program: Gaussian 09
title: 000226398
version: EM64L-G09RevD.01
frameworkgroup: C1[X(C14H18)]
method: RPBEPBE
basis: SDD
operation: Freq
keyword: #p
keyword: freq=noraman
keyword: PBEPBE/SDD
title: #p freq=noraman PBEPBE/SDD
converged: NO YES NO NO
title: Mulliken charges:
elementType: C C C C C C C C C C C C C C H H H H H H H H H H H H H H H H H H
charge: 0.117782 0.148416 0.190594 -0.469738 0.270551 -0.728141 -0.728388 0.318436 -0.619797 -0.626825 0.504332 -0.817467 -0.844034 -0.826661 0.252382 0.211807 0.236018 0.216524 0.211760 0.216862 0.236144 0.243621 0.227649 0.232456 0.228727 0.228792 0.231392 0.230973 0.229390 0.221651 0.222567 0.232225
chargesum: 0.00000
title: Mulliken charges with hydrogens summed into heavy atoms:
elementType: C C C C C C C C C C C C C C
charge: 0.117782 0.148416 0.190594 -0.217356 0.270551 -0.063791 -0.063622 0.318436 -0.376176 -0.399176 0.504332 -0.127492 -0.152279 -0.150219
polarizability: 1.94505747e+02 -1.90835146e+00 1.65370115e+02 -3.65812032e-01 7.95572043e-02 9.29773061e+01
1716.lowfreq: -4.8028 -0.0008 -0.0007 0.0002 1.9874 11.2702 38.1463 51.4360 89.0899
frequency: 37.4265 51.3885 89.0378 120.6667 145.8144 170.7211 191.0574 201.5142 211.0732 248.2390 254.5289 256.5485 277.5877 294.4739 355.1764 374.2474 392.2968 462.6498 506.9129 517.6534 543.6847 571.9161 584.5362 593.0870 628.3923 672.3557 776.3371 828.8882 865.1249 872.7102 896.0857 905.2959 935.3307 944.1924 960.0812 989.6072 1004.0471 1008.4806 1021.3455 1038.5877 1045.3291 1048.0826 1078.3699 1138.1887 1146.8287 1156.2342 1195.8071 1245.5118 1259.7043 1278.1344 1347.1801 1371.5174 1381.7630 1385.3501 1395.5373 1396.2062 1398.2268 1428.6022 1453.4342 1460.2875 1462.2705 1465.2341 1472.1858 1473.3089 1474.3467 1480.5051 1483.8270 1486.8388 1490.6502 1589.6405 1617.5753 1635.1399 2966.8545 2969.9963 2974.6318 2977.5986 2981.2245 3039.6709 3050.5191 3059.9455 3066.0836 3070.1455 3077.8020 3078.3914 3082.8993 3083.7590 3087.9775 3105.0847 3119.3516 3150.1550
redmass: 1.9150 1.0141 1.7377 2.3565 2.0124 1.0859 2.9309 2.3664 2.1620 1.1458 2.8009 1.3377 2.2923 2.2105 2.7467 3.2372 3.6295 4.0409 3.0098 3.8104 3.8776 3.7886 2.9010 3.5432 3.2710 4.0438 3.1511 1.3980 1.4032 3.0094 1.4102 2.5186 1.4795 2.0605 3.4879 1.6013 1.2914 1.5572 1.4560 1.5463 1.5511 1.5786 2.8561 4.1594 2.2363 1.5758 2.1770 3.0915 1.6153 2.4820 4.3334 1.1781 3.2398 1.4003 1.2379 1.2999 1.2487 3.0430 2.1219 1.0507 1.0479 1.0455 1.0787 1.0746 1.1083 1.2924 1.0500 1.1050 1.1524 7.3498 6.4014 7.3139 1.0376 1.0382 1.0345 1.0351 1.0361 1.0969 1.0953 1.0979 1.0986 1.0991 1.0988 1.0996 1.0982 1.1008 1.0998 1.0906 1.0918 1.0956
irintensity: 0.0675 0.4674 1.4869 2.1417 2.4041 0.3305 0.2894 1.1026 0.5502 0.5436 0.3903 0.0106 0.9688 0.4506 0.0179 0.4952 1.2072 0.9005 0.0229 1.3432 0.3293 1.8354 4.8843 0.3978 4.2861 1.8549 6.7577 14.2224 24.4145 2.8535 6.5773 0.6690 0.9178 7.8926 6.0652 2.9643 1.0970 2.3725 5.4366 0.9408 3.3387 21.4103 14.9658 4.6866 0.9371 2.3679 0.7764 5.8964 0.5957 1.3140 7.8917 13.5881 0.2338 5.6796 20.8067 14.2699 1.6308 11.1487 5.8124 14.9911 1.1066 14.6650 9.7303 9.9397 1.7879 20.5151 3.0017 15.8434 27.6086 9.8209 28.9554 3.2066 34.9039 50.8594 28.3113 25.5698 60.4442 21.1194 24.1534 17.3639 7.7801 73.2642 3.3375 20.0273 25.6582 14.2185 45.5543 26.8097 15.3567 12.3059
temp: 298.150 k
press: 1.00000 atm
elementType: 6 6 6 6 6 6 6 6 6 6 6 6 6 6 1 1 1 1 1 1 1 1 1 1 1 1 1 1 1 1 1 1
symmnumber: 1
zpe: 720648.4 jmol-1
zpe.correction: 0.274480 hartree
zpe.thermalcorrener: 0.289416 hartree
zpe.thermalcorrenthalpy: 0.290360 hartree
zpe.thermalcorrgfe: 0.233183 hartree
zpe.sumelectzpe: -543.259447 hartree
zpe.sumelectthermal: -543.244512 hartree
zpe.sumelectthermalent: -543.243568 hartree
zpe.sumelectthermalfe: -543.300745 hartree
dipole: 0.2886 -0.0908 0.0610
dipole: 0.3087
quadrupole: -78.5055 -78.4107 -88.8349
quadrupole: -0.2770 -0.1936 0.0128
quadrupole: 3.4115 3.5063 -6.9178 -0.2770 -0.1936 0.0128
hfenergy: -543.5339279 hartree
pointgroup: C01 [X(C14H18)]
dipole: 0.1104326 0.0444395 -0.0240199 debye
polarizability: 194.0351859|4.1398179|165.8409119|0.3183447|0.1182304|92.9770701 unknown
InChI: InChI=1S/C14H18/c1-9-6-10(2)13-12(7-9)11(3)8-14(13,4)5/h6-8H,1-5H3
charge 0 multiplicity 1
32 atoms
C  1.825772 0.517977 -0.00317
C  0.282739 0.469723 0.00167
C  -0.134819 -0.895994 0.004618
C  2.175609 -0.973534 -0.002364
C  1.062229 -1.770841 0.003268
C  2.402891 1.195371 -1.282317
C  2.412014 1.197857 1.270486
C  -0.684473 1.503671 0.006672
C  -1.499402 -1.253654 0.012752
C  -2.055802 1.12103 0.013872
C  -2.481859 -0.232294 0.012486
C  0.999134 -3.276494 0.006569
C  -0.332557 2.98382 0.00969
C  -3.963107 -0.57287 -0.013374
H  3.213466 -1.322595 -0.005568
H  3.501839 1.071881 -1.316289
H  1.976147 0.742031 -2.19428
H  2.186839 2.278837 -1.294401
H  3.51096 1.072672 1.297629
H  2.197889 2.281684 1.281179
H  1.990525 0.747481 2.186351
H  -1.802585 -2.308123 0.01891
H  -2.817771 1.912143 0.021416
H  2.007348 -3.724675 0.004261
H  0.453524 -3.654668 -0.879991
H  0.459367 -3.650793 0.898334
H  0.261474 3.263267 0.899206
H  0.259737 3.266969 -0.879838
H  -1.246691 3.602854 0.011885
H  -4.154702 -1.573046 0.414464
H  -4.558317 0.162657 0.55727
H  -4.354321 -0.577744 -1.049793
