program: Gaussian 09
title: 000237848
version: EM64L-G09RevD.01
frameworkgroup: C1[X(C11H10ClN5)]
method: RPBEPBE
basis: SDD
operation: Freq
keyword: #p
keyword: freq=noraman
keyword: PBEPBE/SDD
title: #p freq=noraman PBEPBE/SDD
converged: YES YES NO NO
title: Mulliken charges:
elementType: Cl N N N N N C C C C C C C C C C C H H H H H H H H H H
charge: 0.000235 -0.083022 -0.136580 -0.117172 -0.613777 -0.629728 0.125725 0.066246 -0.089824 -0.347307 0.193841 0.179508 -0.347727 -0.295999 -0.204312 -0.204157 -0.243063 0.248309 0.254425 0.244342 0.228448 0.223706 0.228039 0.320719 0.347696 0.330769 0.320659
chargesum: 0.00000
title: Mulliken charges with hydrogens summed into heavy atoms:
elementType: Cl N N N N N C C C C C C C C C C C
charge: 0.000235 -0.083022 -0.136580 -0.117172 0.054637 0.021700 0.125725 0.066246 -0.089824 -0.098998 0.193841 0.179508 -0.093302 -0.051657 0.024137 0.019549 -0.015024
polarizability: 4.15449558e+02 6.14151286e+00 1.77458431e+02 -1.20189188e+00 -6.00852789e+00 6.59906214e+01
1716.lowfreq: -6.4387 -3.3927 -0.0026 -0.0010 -0.0010 0.3267 18.7942 36.7351 56.3500
frequency: 18.7495 36.7283 56.3492 87.2129 161.2184 166.7731 192.7041 221.6680 239.8236 242.6157 262.5800 308.0908 376.3823 394.3849 407.1494 410.7354 447.1552 490.3262 498.8766 512.9981 518.6938 560.4411 580.1949 596.7681 610.1223 631.7140 652.3217 675.2845 692.1580 762.7666 780.6338 793.4821 803.8570 829.6930 846.5225 892.5386 930.8647 977.5078 979.5189 984.7890 994.5238 1004.2968 1014.4054 1074.7898 1114.5897 1141.3397 1165.1934 1168.7575 1194.6909 1245.2885 1303.6502 1345.1676 1353.2055 1385.8606 1390.1425 1438.6710 1440.6511 1462.9633 1470.1722 1515.4622 1571.3099 1579.5898 1593.1762 1600.8617 1621.0819 3124.1847 3135.7288 3151.4372 3161.8042 3168.0754 3169.7201 3505.3844 3551.0174 3684.0274 3706.0005
redmass: 4.2417 5.6505 6.3033 6.0589 5.4790 7.5208 7.4225 6.0855 6.4306 6.0944 5.9242 3.2202 3.9805 7.9562 2.8988 1.2156 4.0398 1.2454 6.8117 1.1577 3.4496 4.9425 6.0404 5.6472 6.5380 6.1893 1.3189 2.2899 1.8325 3.2706 2.1670 6.0644 1.9539 7.3830 1.2512 6.1601 1.4820 2.3763 1.6086 4.7198 1.3279 1.6951 2.0835 1.5067 2.8106 2.4558 1.3454 1.0652 1.8569 3.3389 1.3866 5.2200 7.4099 7.0177 7.1776 3.8287 2.4658 2.3011 3.4059 2.5329 2.2157 6.0026 4.3836 6.2863 1.4645 1.0850 1.0885 1.0926 1.0949 1.0933 1.1004 1.0452 1.0449 1.1035 1.1048
irintensity: 0.0235 1.7567 1.1690 1.1606 2.5164 0.8581 0.8419 13.3489 1.2176 0.4051 4.0126 10.9452 0.4885 1.7515 0.5311 185.2690 34.3795 16.1574 11.2253 273.9684 11.9981 5.6927 10.6869 36.4016 0.8085 1.7529 45.2876 14.5825 52.2710 29.1163 40.8470 8.0988 48.0804 27.6198 0.3843 8.6200 7.1880 12.7221 4.3241 0.0747 0.5811 9.4626 9.2041 14.2699 10.9965 0.4121 5.6630 0.1038 5.1023 5.3823 3.0835 533.1487 11.4390 4.1215 20.0639 43.4065 1.6788 17.9001 57.1081 50.7099 407.3640 8.6193 742.3696 10.1266 587.2060 4.6686 10.8789 24.2823 24.0621 3.7983 33.6234 40.8098 231.1119 78.5457 38.5866
temp: 298.150 k
press: 1.00000 atm
elementType: 17 7 7 7 7 7 6 6 6 6 6 6 6 6 6 6 6 1 1 1 1 1 1 1 1 1 1
symmnumber: 1
zpe: 521449.9 jmol-1
zpe.correction: 0.198610 hartree
zpe.thermalcorrener: 0.213618 hartree
zpe.thermalcorrenthalpy: 0.214563 hartree
zpe.thermalcorrgfe: 0.154963 hartree
zpe.sumelectzpe: -1157.772185 hartree
zpe.sumelectthermal: -1157.757176 hartree
zpe.sumelectthermalent: -1157.756232 hartree
zpe.sumelectthermalfe: -1157.815832 hartree
dipole: -2.8815 -1.8693 0.0413
dipole: 3.4350
quadrupole: -66.7926 -94.3340 -111.2335
quadrupole: -3.3544 -0.3655 -1.4788
quadrupole: 23.9941 -3.5473 -20.4468 -3.3544 -0.3655 -1.4788
hfenergy: -1157.9707947 hartree
pointgroup: C01 [X(C11H10Cl1N5)]
dipole: 1.146846 -0.2951105 -0.6511682 debye
polarizability: 415.5967168|-0.0092952|82.0606953|-2.0277301|39.5827377|161.241199 unknown
InChI: InChI=1S/C11H10ClN5/c12-8-6-9(13)15-11(14)10(8)17-16-7-4-2-1-3-5-7/h1-6H,13-14H2
charge 0 multiplicity 1
27 atoms
Cl 1.060451 1.302004 2.578921
N  3.389023 -0.653749 -0.933246
N  -0.185241 -0.22202 -0.167086
N  -1.0492 0.139576 0.756632
N  1.418336 -1.272779 -2.016055
N  5.388609 -0.070507 0.103175
C  1.183997 -0.097457 0.100387
C  2.027828 -0.670018 -0.948577
C  1.897596 0.502508 1.184743
C  3.296245 0.531077 1.21883
C  4.00917 -0.065599 0.1302
C  -2.420046 0.019078 0.357725
C  -3.363441 0.196593 1.406241
C  -2.881276 -0.222974 -0.968818
C  -4.74586 0.111545 1.141693
C  -4.263361 -0.300279 -1.22603
C  -5.201669 -0.138241 -0.174813
H  3.823571 1.00297 2.051396
H  -2.981055 0.395581 2.41275
H  -2.148511 -0.331517 -1.774528
H  -5.466565 0.244071 1.956133
H  -4.618629 -0.479737 -2.247514
H  -6.275647 -0.197389 -0.384039
H  1.98964 -1.67006 -2.757092
H  0.397832 -1.283136 -2.028377
H  5.850617 -0.505294 -0.692775
H  5.939582 0.339856 0.851319
