program: Gaussian 09
title: 000226389
version: EM64L-G09RevD.01
frameworkgroup: C1[X(C16H19Cl3O5)]
method: RPBEPBE
basis: SDD
operation: Freq
keyword: #p
keyword: freq=noraman
keyword: PBEPBE/SDD
title: #p freq=noraman PBEPBE/SDD
converged: YES YES NO NO
title: Mulliken charges:
elementType: Cl Cl Cl O O O O O C C C C C C C C C C C C C C C C H H H H H H H H H H H H H H H H H H H
charge: -0.002275 -0.012606 -0.003685 -0.267379 -0.278296 -0.242961 -0.226107 -0.192036 -0.368458 -0.346059 -0.260062 -0.095188 -0.127160 0.265259 0.264765 -0.684912 -0.697869 -0.712756 0.567545 -0.367463 -0.270688 -0.114144 -0.184916 -0.123933 0.212628 0.206843 0.197379 0.199839 0.225040 0.231400 0.270425 0.252102 0.213817 0.221269 0.211956 0.233320 0.241920 0.241708 0.252451 0.245174 0.238994 0.301592 0.283528
chargesum: 0.00000
title: Mulliken charges with hydrogens summed into heavy atoms:
elementType: Cl Cl Cl O O O O O C C C C C C C C C C C C C C C C
charge: -0.002275 -0.012606 -0.003685 -0.267379 -0.278296 -0.242961 -0.226107 -0.192036 0.051013 0.051160 0.196378 0.175237 0.124942 0.265259 0.264765 -0.037870 0.019079 0.023862 0.567545 -0.367463 0.030903 -0.114144 0.098612 -0.123933
polarizability: 2.69794495e+02 -7.24306103e+00 2.50996025e+02 -1.97879677e+01 -6.09870997e+00 1.48838110e+02
1716.lowfreq: -4.9047 -0.0955 -0.0019 -0.0011 -0.0008 4.0631 6.1389 12.4244 19.5310
frequency: 5.3164 12.3993 19.4928 25.9357 39.0988 43.0081 62.0833 66.2984 77.7175 84.0830 100.1117 106.1475 123.8592 133.4502 153.8941 166.2595 180.4764 191.9447 192.7727 217.9271 225.3800 228.2689 232.3425 234.3415 239.7071 271.6958 289.5826 316.6311 317.3435 346.1252 355.5108 373.8555 397.5476 411.8941 447.1720 448.2631 503.9017 520.3534 571.2327 605.6464 621.3787 655.1633 668.6118 692.9039 708.4375 710.5242 717.7452 740.7360 796.0980 815.2173 821.5226 839.9289 845.9041 864.6836 873.6621 908.1645 916.2359 931.4268 936.4478 1024.9366 1031.5129 1037.6403 1040.4086 1067.0736 1080.2854 1084.9709 1095.5564 1123.2469 1125.6255 1126.4682 1141.3383 1146.1420 1164.0448 1211.8443 1231.5734 1252.3759 1270.1766 1271.9175 1280.8748 1287.6835 1308.7295 1318.3796 1327.6853 1333.3142 1344.1523 1370.6702 1373.5100 1391.8720 1393.2137 1394.4639 1456.6678 1462.0357 1468.0122 1469.0724 1472.3211 1472.6091 1477.6728 1477.7502 1480.4265 1490.6460 1556.7277 1589.0275 1642.1236 1669.4884 2970.9200 2977.5913 2992.9904 3005.8675 3006.3536 3006.4994 3014.8702 3022.4155 3032.5540 3047.8752 3073.0166 3078.9427 3082.8110 3108.6483 3110.9135 3117.5872 3120.5815 3174.9615 3181.7092
redmass: 5.0024 7.3934 4.0117 7.9804 6.7815 5.0242 2.7402 3.6884 6.3152 5.9941 5.5284 2.3815 4.8060 5.5932 2.9259 6.7322 22.3030 4.7451 4.8845 1.3644 1.2767 2.6089 2.5637 1.2783 3.3157 4.9632 8.1525 4.9974 15.8068 8.3725 10.3311 4.5851 4.3296 3.7043 3.1859 7.7603 6.0771 7.1211 4.9708 10.2074 6.1907 7.8283 4.0845 3.4700 5.4554 6.1518 5.5275 1.0704 1.1378 3.3109 4.8378 5.1353 1.5668 1.3855 5.2123 1.8869 4.4781 1.1658 3.9355 2.3694 2.0955 5.2553 3.2452 3.1277 2.2034 1.8998 2.4179 2.6504 2.1328 2.5388 2.2532 1.4731 2.9045 1.3527 4.5879 1.2663 1.1714 1.2841 1.3623 1.0796 1.4392 1.4906 2.2252 2.3707 1.4359 1.5433 9.4424 1.2082 1.2234 1.2080 2.7481 1.0643 1.0481 1.0821 1.0679 1.0563 1.0439 1.0517 1.0622 1.0907 8.4758 8.5551 11.1827 10.4676 1.0589 1.0366 1.0599 1.0352 1.0556 1.0358 1.1005 1.0858 1.0840 1.1037 1.1026 1.0994 1.1070 1.1013 1.1005 1.1002 1.1016 1.0918 1.0930
irintensity: 0.1037 0.4764 0.3316 0.1674 1.0556 0.1564 0.0103 0.5744 1.6038 1.8399 0.5278 0.0133 2.0644 1.3660 0.5577 2.6848 0.2528 2.2709 0.2843 4.0625 0.3667 3.1976 0.7904 1.0556 4.1555 0.2534 8.7562 3.6712 4.2551 3.5676 2.4223 8.7685 11.3605 6.1254 11.5235 2.4079 0.5915 13.1643 0.7799 0.1928 9.1117 46.8970 6.8733 0.6119 7.5939 39.6646 4.3329 8.9902 0.4501 4.5036 2.2519 18.3501 6.5949 44.1640 16.8148 4.3223 16.0345 0.4805 52.0086 21.0260 45.0513 222.9752 14.5927 629.8566 9.0572 13.0698 60.3351 59.6989 36.6246 41.5530 12.9929 3.3978 201.8349 0.0509 115.3327 6.9968 0.5558 3.0245 1.6176 0.2072 18.8938 12.6756 49.4811 47.0887 0.4600 7.1661 5.7826 15.7424 14.9699 24.1464 245.3868 27.2599 10.1237 0.5010 0.6811 11.2256 13.8837 14.5389 6.2804 20.5147 6.5204 28.9389 182.3622 117.3526 26.5563 30.5353 19.3731 12.3662 23.9788 13.9961 6.6029 11.9884 3.9226 3.6488 18.2018 46.7809 94.8223 16.9416 10.9086 13.8271 11.9063 4.1904 0.5157
temp: 298.150 k
press: 1.00000 atm
elementType: 17 17 17 8 8 8 8 8 6 6 6 6 6 6 6 6 6 6 6 6 6 6 6 6 1 1 1 1 1 1 1 1 1 1 1 1 1 1 1 1 1 1 1
symmnumber: 1
zpe: 845563.9 jmol-1
zpe.correction: 0.322058 hartree
zpe.thermalcorrener: 0.349182 hartree
zpe.thermalcorrenthalpy: 0.350126 hartree
zpe.thermalcorrgfe: 0.258122 hartree
zpe.sumelectzpe: -2375.567842 hartree
zpe.sumelectthermal: -2375.540719 hartree
zpe.sumelectthermalent: -2375.539774 hartree
zpe.sumelectthermalfe: -2375.631778 hartree
dipole: -5.3528 -1.3076 1.5536
dipole: 5.7250
quadrupole: -141.3827 -167.9690 -162.4535
quadrupole: 8.1442 1.9887 2.2457
quadrupole: 15.8857 -10.7006 -5.1851 8.1442 1.9887 2.2457
hfenergy: -2375.8899003 hartree
pointgroup: C01 [X(C16H19Cl3O5)]
dipole: 2.069587 0.5696766 0.6822904 debye
polarizability: 266.1271588|-3.9588934|250.7638172|28.9205978|-9.0609466|152.7376541 unknown
InChI: InChI=1S/C16H19Cl3O5/c1-4-5-6-22-15(20)9(2)24-16(21)10(3)23-14-8-12(18)11(17)7-13(14)19/h7-10H,4-6H2,1-3H3
charge 0 multiplicity 1
43 atoms
Cl -4.528391 -2.961812 -1.048066
Cl -3.255611 3.264511 -0.126831
Cl -5.961977 2.33369 -1.775746
O  4.109685 0.589141 -0.004582
O  0.56505 0.316238 0.877302
O  -2.18634 -1.855249 0.386832
O  2.974972 -0.963555 1.318276
O  0.489137 -1.271219 -0.841657
C  6.486558 0.595982 -0.544792
C  7.863523 -0.093466 -0.384971
C  5.393906 -0.156321 0.212002
C  1.7636 0.938922 0.260946
C  -0.976211 -1.499629 1.158097
C  2.983056 0.061919 0.605129
C  0.080727 -0.844402 0.253111
C  8.982143 0.650739 -1.144952
C  1.865858 2.362437 0.818654
C  -0.427889 -2.815942 1.71717
C  -3.000506 -0.825949 -0.082946
C  -4.171095 -1.208598 -0.792005
C  -2.747482 0.554681 0.110291
C  -3.642181 1.51597 -0.401353
C  -5.059827 -0.248846 -1.299574
C  -4.796655 1.124673 -1.104655
H  6.217547 0.651537 -1.616886
H  6.543624 1.636256 -0.170695
H  8.124336 -0.154237 0.691082
H  7.798981 -1.13794 -0.751259
H  5.586751 -0.200898 1.299807
H  5.256319 -1.188161 -0.160155
H  1.64371 0.939583 -0.838353
H  -1.242428 -0.797388 1.970164
H  8.765064 0.693861 -2.228544
H  9.957515 0.148082 -1.015354
H  9.085887 1.690073 -0.781165
H  1.952802 2.347465 1.918195
H  2.752761 2.861927 0.395806
H  0.966161 2.937998 0.543612
H  -0.201644 -3.507816 0.889515
H  0.499038 -2.626728 2.285516
H  -1.17587 -3.278753 2.381514
H  -1.859969 0.899521 0.646101
H  -5.953833 -0.562395 -1.844182
