program: Gaussian 09
title: 000237811
version: EM64L-G09RevD.01
frameworkgroup: C1[X(C13H10N4O5)]
method: RPBEPBE
basis: SDD
operation: Freq
keyword: #p
keyword: freq=noraman
keyword: PBEPBE/SDD
title: #p freq=noraman PBEPBE/SDD
converged: YES YES NO YES
title: Mulliken charges:
elementType: O O O O O N N N N C C C C C C C C C C C C C H H H H H H H H H H
charge: -0.279421 -0.198614 -0.198613 -0.209934 -0.209934 -0.509269 -0.509269 0.019138 0.019137 0.527978 0.527993 -0.596073 -0.596075 0.427978 0.427978 -0.339292 -0.339306 0.285786 -0.388470 -0.388471 -0.170097 -0.170081 0.279434 0.279432 0.305683 0.305681 0.317115 0.317105 0.289430 0.289431 0.241809 0.241810
chargesum: 0.00000
title: Mulliken charges with hydrogens summed into heavy atoms:
elementType: O O O O O N N N N C C C C C C C C C C C C C
charge: -0.279421 -0.198614 -0.198613 -0.209934 -0.209934 -0.203587 -0.203588 0.019138 0.019137 0.527978 0.527993 -0.316639 -0.316643 0.427978 0.427978 -0.022177 -0.022201 0.285786 -0.099040 -0.099039 0.071711 0.071729
polarizability: 3.63950713e+02 -3.38680256e-04 2.13209302e+02 -1.36212985e-04 2.08660752e-02 7.05523553e+01
1716.lowfreq: -0.0006 -0.0002 0.0005 3.5087 6.4566 12.3305 22.9410 30.8434 49.2632
frequency: 22.8101 29.9243 49.2632 53.5989 65.6761 70.6273 83.7244 129.8234 160.6717 168.8240 169.9666 228.8278 233.4068 237.2105 270.9718 324.0246 353.2786 401.1056 406.1972 426.4693 427.3365 457.6033 492.7173 522.9926 533.3550 534.8565 555.7386 630.6732 633.8204 650.5747 673.7310 682.4531 684.7359 699.4692 705.9573 709.4281 745.5755 777.2388 788.5462 819.6936 820.9101 894.2176 905.8143 911.7354 913.4670 950.0828 951.2470 983.4498 984.7099 1008.4325 1009.3446 1033.2729 1085.5894 1085.8584 1090.9838 1092.2870 1176.8620 1178.2148 1182.5226 1216.7439 1216.7825 1246.9567 1266.1267 1302.1100 1312.8341 1366.6545 1373.1802 1380.4364 1388.5716 1434.0290 1438.1426 1480.7741 1488.1148 1515.5093 1522.5437 1593.5762 1596.7946 1623.7188 1625.1694 1657.3553 3149.4409 3149.5223 3156.2690 3156.3365 3192.2259 3192.2698 3201.5255 3201.8059 3519.6382 3532.0453
redmass: 6.2363 7.4368 9.6747 11.3141 9.3330 9.5260 4.8462 8.9941 9.2716 5.5579 5.2409 8.8561 2.7322 4.0078 7.6047 9.9837 6.6507 8.5130 9.2771 2.9708 3.3250 1.6737 8.1042 6.7067 7.1492 4.3794 3.8302 1.2466 6.9340 7.7746 9.6240 2.3666 2.4723 7.8064 5.6388 6.2813 11.0904 6.7338 9.8697 1.3736 1.3712 5.8202 5.5777 1.6226 1.6193 1.3643 1.3630 6.0047 6.2304 1.3346 1.3318 5.1639 1.8335 1.8648 1.5586 1.5762 1.2811 1.1534 2.3316 7.4110 5.2051 2.1556 1.6544 1.5322 1.9821 4.0591 8.7467 8.6930 6.4487 4.1829 3.7551 2.8798 2.7690 2.0797 2.2779 5.1273 5.9076 7.0308 6.2389 3.8749 1.0921 1.0921 1.0898 1.0898 1.0942 1.0942 1.0961 1.0959 1.0770 1.0760
irintensity: 0.0000 1.1560 1.3729 0.0000 0.1963 17.7817 0.0000 11.7140 0.0317 0.2743 0.0000 1.9441 0.0000 3.3950 8.9432 0.9026 0.6875 0.3831 6.0295 0.0000 1.5263 0.0000 10.0129 0.7015 9.7847 31.6097 0.0000 112.4721 1.3236 5.3953 9.5474 0.0000 38.1580 0.0233 0.0000 101.4657 41.3247 6.2531 13.9059 0.0005 78.2127 1.3967 2.1671 0.0000 100.4905 0.0000 0.4169 0.0583 1.9539 0.0002 8.2848 0.8918 5.5437 23.4709 7.0952 49.9676 34.9669 7.9827 496.0890 262.1343 150.8956 362.2836 0.9518 210.6412 4.8812 1.7133 246.3312 149.5637 148.2474 16.6569 37.9987 494.3876 10.6452 1113.3339 1.2616 67.0724 8.8970 119.1925 0.5399 116.7020 15.9571 1.5435 1.5342 18.0398 13.5148 2.3981 14.3477 0.0929 4.6330 22.9179
temp: 298.150 k
press: 1.00000 atm
elementType: 8 8 8 8 8 7 7 7 7 6 6 6 6 6 6 6 6 6 6 6 6 6 1 1 1 1 1 1 1 1 1 1
symmnumber: 1
zpe: 588377.9 jmol-1
zpe.correction: 0.224101 hartree
zpe.thermalcorrener: 0.242777 hartree
zpe.thermalcorrenthalpy: 0.243721 hartree
zpe.thermalcorrgfe: 0.174418 hartree
zpe.sumelectzpe: -1094.820699 hartree
zpe.sumelectthermal: -1094.802024 hartree
zpe.sumelectthermalent: -1094.801080 hartree
zpe.sumelectthermalfe: -1094.870382 hartree
dipole: 0.0004 -3.2701 0.0018
dipole: 3.2701
quadrupole: -190.2562 -128.1324 -128.2713
quadrupole: -0.0008 -0.0011 0.0077
quadrupole: -41.3696 20.7542 20.6153 -0.0008 -0.0011 0.0077
hfenergy: -1095.0448005 hartree
pointgroup: C01 [X(C13H10N4O5)]
dipole: -0.0001529 1.2865496 0.0010031 debye
polarizability: 363.950713|0.0002565|213.2093042|-0.007072|0.0105527|70.5523532 unknown
InChI: InChI=1S/C13H10N4O5/c18-13(14-9-3-1-5-11(7-9)16(19)20)15-10-4-2-6-12(8-10)17(21)22/h1-8,14-15H
charge 0 multiplicity 1
32 atoms
O  0.000744 1.871002 0.000713
O  7.152168 -1.008515 -0.001313
O  -7.150786 -1.008636 -0.000926
O  5.528648 -2.609826 -0.000857
O  -5.527218 -2.609887 -0.000498
N  1.16733 -0.178972 0.000734
N  -1.165971 -0.17893 0.000783
N  5.916302 -1.376854 -0.000876
N  -5.914906 -1.376926 -0.000589
C  2.51305 0.275625 0.000321
C  -2.5117 0.275663 0.000427
C  3.52404 -0.717492 -0.000057
C  -3.522663 -0.717481 0.000117
C  4.873267 -0.318381 -0.000473
C  -4.871904 -0.318417 -0.000254
C  2.880642 1.651512 0.000271
C  -2.87934 1.65154 0.000365
C  0.000697 0.607386 0.001092
C  5.266544 1.036327 -0.000535
C  -5.265224 1.036278 -0.000328
C  4.245826 2.008775 -0.000156
C  -4.244536 2.008758 -0.000009
H  3.293244 -1.788314 -0.000045
H  -3.291833 -1.788296 0.000151
H  1.061549 -1.195939 0.000671
H  -1.060209 -1.195899 0.000727
H  2.09872 2.412142 0.000567
H  -2.097448 2.412198 0.000613
H  6.327323 1.296606 -0.000868
H  -6.326011 1.296523 -0.000626
H  4.513354 3.07023 -0.00019
H  -4.5121 3.070203 -0.000052
