program: Gaussian 09
title: 000237783
version: EM64L-G09RevD.01
frameworkgroup: C1[X(C6H6N2O4)]
method: RPBEPBE
basis: SDD
operation: Freq
keyword: #pfreq=noraman
keyword: PBEPBE/SDD
title: #p freq=noraman PBEPBE/SDD
converged: YES YES NO NO
title: Mulliken charges:
elementType: O O O O N N C C C C C C H H H H H H
charge: -0.278637 -0.323821 -0.184364 -0.185162 0.035434 0.034427 0.285958 0.251394 -0.282599 -0.254431 -0.191187 -0.511381 0.326992 0.264033 0.291284 0.215155 0.245770 0.261132
chargesum: 0.00000
title: Mulliken charges with hydrogens summed into heavy atoms:
elementType: O O O O N N C C C C C C
charge: -0.278637 -0.323821 -0.184364 -0.185162 0.035434 0.034427 0.285958 0.251394 0.044393 0.009602 0.100098 0.210677
polarizability: 1.47636192e+02 7.00041790e+00 1.13153022e+02 1.10408782e+00 8.16767324e-01 4.58897837e+01
1716.lowfreq: -7.5595 -4.0680 -0.0005 -0.0003 -0.0002 6.1625 41.5532 82.5115 103.6729
frequency: 41.5484 82.5071 103.6718 142.5115 159.7102 191.4334 214.2406 293.9538 341.9006 395.2714 410.5955 442.9916 469.7680 545.4605 577.1756 663.6342 676.0079 729.1247 739.3220 754.3562 824.6216 864.6830 916.3402 935.5403 946.2802 1068.1689 1101.1379 1113.7661 1147.8252 1198.3751 1210.5536 1236.4772 1263.3898 1287.0339 1373.7209 1419.0190 1446.4027 1454.3811 1455.7212 1477.9720 1485.0771 1618.9776 2982.7413 3094.4543 3142.9287 3177.1456 3215.7567 3220.5010
redmass: 8.3051 5.0325 3.5231 1.1288 4.9396 8.3047 4.4081 11.4236 8.1184 4.7067 8.6296 5.4145 8.0407 3.3861 5.4800 6.2209 7.4382 5.5462 4.6426 10.8183 1.5285 1.5563 4.3930 1.4874 5.5863 3.0786 1.2304 1.7077 1.3195 2.9380 2.5332 5.1451 3.7215 2.8593 6.1438 1.5192 2.2512 1.4789 1.6909 1.0630 8.7638 6.6844 1.0328 1.1011 1.1040 1.0910 1.0956 1.0952
irintensity: 0.2917 2.8429 4.0746 0.4203 3.9020 2.0155 11.8933 4.3604 2.4205 1.6637 8.4019 2.5109 2.7218 15.8365 7.0450 1.2367 5.7173 0.2586 34.8442 20.9432 43.5006 31.1556 27.0797 4.1587 76.6032 3.0264 0.8811 5.8108 4.3760 118.7830 111.6591 102.1371 81.1889 4.5816 86.5805 117.3191 21.0215 6.8857 160.6928 14.7689 4.2542 1.8882 64.8155 21.0652 15.0366 0.7448 5.3814 10.7308
temp: 298.150 k
press: 1.00000 atm
elementType: 8 8 8 8 7 7 6 6 6 6 6 6 1 1 1 1 1 1
symmnumber: 1
zpe: 320923.2 jmol-1
zpe.correction: 0.122233 hartree
zpe.thermalcorrener: 0.133141 hartree
zpe.thermalcorrenthalpy: 0.134085 hartree
zpe.thermalcorrgfe: 0.084728 hartree
zpe.sumelectzpe: -641.575390 hartree
zpe.sumelectthermal: -641.564482 hartree
zpe.sumelectthermalent: -641.563538 hartree
zpe.sumelectthermalfe: -641.612894 hartree
dipole: -1.2730 -4.9944 1.0642
dipole: 5.2628
quadrupole: -81.7681 -65.6856 -69.7151
quadrupole: 2.6587 -4.2462 -0.4273
quadrupole: -9.3785 6.7040 2.6745 2.6587 -4.2462 -0.4273
hfenergy: -641.6976229 hartree
pointgroup: C01 [X(C6H6N2O4)]
dipole: -0.2942651 1.9883955 -0.4969001 debye
dipolederiv: -1.2077067 0.6107905 -0.1742401 0.474083 -0.649854 0.0993738 -0.0022826 -0.0246664 -0.3812806 -1.1198184 0.2585811 0.0356393 0.3349286 -0.3394627 -0.0130128 0.0887742 -0.0174264 -0.315568 -0.4259946 -0.0395336 -0.070594 -0.050625 -0.8108744 0.2015437 -0.099823 0.1460504 -0.3013203 -0.7288501 -0.0070512 -0.2215683 -0.0406238 -0.4229547 0.101393 -0.1804051 0.153458 -0.3143775 1.13519 -0.4479171 -0.0669305 -0.4631748 -0.0505334 0.0106561 -0.0921457 0.020306 0.1140614 1.1827791 0.3293672 0.3437721 0.3114616 1.2739079 -0.3360355 0.3053691 -0.2752557 0.415884 0.8678267 -0.608656 -0.0038873 -0.2394669 0.3277597 0.008615 -0.2769337 0.1241827 -0.0061337 -0.2011269 -0.4230415 -0.088065 -0.1087903 -0.1722156 0.0381365 -0.0238611 -0.0026157 0.0570542 -0.1743063 0.3757606 0.0167182 -0.2623259 0.026481 0.0143788 0.0096934 0.030585 -0.0788737 -0.1470877 0.22578 -0.0038895 -0.1285389 0.1073557 0.0436286 0.0150138 0.0474083 -0.0798412 0.0254522 -0.0527513 -0.0123852 0.3550094 0.0678512 0.0039217 0.0168208 0.0230083 -0.1034128 0.5642279 -0.2138257 0.1630777 -0.2044188 0.4021969 -0.1272209 0.3358435 -0.2683901 0.4215318 0.0849929 -0.0056159 0.0083894 -0.0063475 0.1279944 -0.0101378 -0.0214392 -0.0036474 0.1922747 0.1102916 0.0248347 0.0109954 0.0059341 -0.0077676 -0.0196546 0.0141579 -0.0218149 0.1547354 0.0467928 -0.0230488 0.0018176 0.0158475 0.087313 -0.0104698 -0.0007495 -0.0175724 0.1848082 -0.0152229 -0.1143345 0.0618355 -0.0270608 -0.0538332 0.1173274 -0.0511695 0.1307536 -0.0101571 -0.0646035 0.1098727 0.0338241 0.1024487 0.0599114 -0.0081249 0.0598539 -0.0264412 0.0539266 0.0671638 0.0007888 -0.0345096 -0.0683402 0.0267244 -0.1143184 -0.0967171 -0.0179222 -0.0033115 unknown
polarizability: 145.8855153|-9.9697725|114.7034515|4.4161152|-1.7542308|46.0900313 unknown
InChI: InChI=1S/C6H6N2O4/c1-12-6-2-3-7(9)4-5(6)8(10)11/h2-4H,1H3
charge 0 multiplicity 1
18 atoms
O  -1.641313 1.459805 0.419132
O  3.474741 -0.6926 -0.161996
O  -1.055805 -2.650344 0.417626
O  -2.38163 -1.08925 -0.589941
N  2.248286 -0.193281 -0.059291
N  -1.274619 -1.469263 -0.050967
C  -0.392678 0.905846 0.159513
C  -0.161738 -0.492041 0.007045
C  1.133033 -1.023199 -0.083535
C  0.768094 1.723141 0.205885
C  2.049018 1.185949 0.088691
C  -2.416025 1.973294 -0.741227
H  1.333666 -2.091074 -0.170734
H  0.651468 2.799416 0.358967
H  2.969451 1.770283 0.114978
H  -1.829257 2.735377 -1.288461
H  -3.313201 2.429944 -0.299885
H  -2.694791 1.136897 -1.402601
