program: Gaussian 09
title: 000237779
version: EM64L-G09RevD.01
frameworkgroup: C1[X(C16H12N2O2)]
method: RPBEPBE
basis: SDD
operation: Freq
keyword: #p
keyword: freq=noraman
keyword: PBEPBE/SDD
title: #p freq=noraman PBEPBE/SDD
converged: YES YES NO NO
title: Mulliken charges:
elementType: O O N N C C C C C C C C C C C C C C C C H H H H H H H H H H H H
charge: -0.257911 -0.257911 -0.063758 -0.063758 0.369967 0.369967 0.247995 0.247995 -0.528105 -0.528105 -0.006054 -0.006054 -0.392215 -0.392215 -0.342460 -0.342460 0.214472 0.214472 -0.764822 -0.764822 0.266240 0.266240 0.243557 0.243557 0.253930 0.253930 0.249495 0.249293 0.260377 0.249293 0.260377 0.249495
chargesum: 0.00000
title: Mulliken charges with hydrogens summed into heavy atoms:
elementType: O O N N C C C C C C C C C C C C C C C C
charge: -0.257911 -0.257911 -0.063758 -0.063758 0.369967 0.369967 0.247995 0.247995 -0.261865 -0.261865 -0.006054 -0.006054 -0.148658 -0.148658 -0.088530 -0.088530 0.214472 0.214472 -0.005657 -0.005658
polarizability: 3.79783760e+02 -7.74079247e+00 1.71937027e+02 2.74148940e-04 1.31340629e-03 9.41983640e+01
1716.lowfreq: -2.7042 -0.0005 -0.0004 0.0003 5.3386 9.0608 31.8158 60.0279 66.8974
frequency: 31.8143 60.0268 66.8809 96.9128 98.4943 108.8391 145.6839 195.7869 204.3837 228.5153 264.7617 265.8190 283.2088 318.0271 381.8995 386.6321 428.6766 445.1924 467.1968 490.0316 501.2352 543.6589 608.8381 624.6960 628.6244 630.1570 664.8254 669.8045 676.0325 716.1318 757.6762 759.8249 800.2495 808.0905 825.2399 827.6502 840.8549 842.9263 868.0541 878.4057 890.7467 925.0619 962.2142 962.3056 999.6674 1002.1710 1020.0492 1047.2987 1047.3018 1087.2044 1098.9993 1133.1283 1137.7159 1185.4038 1200.2515 1219.5655 1227.8971 1271.5100 1281.0379 1305.6946 1341.4369 1386.7104 1398.9901 1399.8326 1435.6900 1442.7454 1444.8657 1454.9873 1454.9880 1458.6750 1459.8202 1498.0521 1553.2367 1558.0785 1605.9597 1613.0347 1626.4715 1633.8648 2998.8649 2998.9042 3077.8876 3077.8921 3132.4621 3132.4637 3146.2239 3146.7944 3171.9242 3172.3616 3176.7132 3177.8259
redmass: 4.6768 4.5142 4.8764 1.1260 1.1138 3.4410 3.7634 4.4537 4.8023 5.9852 3.5400 5.7644 4.5802 4.7833 4.5173 5.1058 3.0027 3.1611 4.4817 6.0880 4.6059 4.9195 5.1693 5.8967 4.7231 7.1529 3.9699 5.6975 4.7979 7.2500 4.6173 4.2553 6.1000 4.8856 6.4724 1.8510 3.7690 1.5109 8.1589 1.4187 1.5695 4.1582 1.3416 1.3602 2.1451 2.0729 1.9699 1.4907 1.4907 3.6397 4.3072 1.5003 1.6849 3.2688 2.9355 1.9182 3.0520 1.9265 1.5172 3.0077 4.3694 5.4292 1.2462 1.3058 3.6937 3.3625 2.8042 1.0441 1.0441 1.1259 1.2032 3.9152 6.9040 7.3273 8.5207 8.7758 7.8525 8.1787 1.0381 1.0380 1.0976 1.0976 1.0986 1.0986 1.0886 1.0883 1.0933 1.0926 1.0964 1.0960
irintensity: 0.4308 0.0912 0.1748 0.1273 0.8669 0.1779 5.1919 2.1454 1.9027 0.4005 7.0100 0.5014 1.5323 2.1849 0.3048 0.1732 10.6915 2.2965 4.6296 2.7828 1.0285 0.1827 6.3608 0.5887 0.7278 2.6811 2.7109 0.1610 4.3474 0.0217 0.0972 0.3069 126.7601 3.3025 25.1507 78.6094 18.4833 3.9692 19.0959 24.9173 6.2822 0.0067 1.3402 0.9556 12.7196 0.0158 0.6435 0.9766 9.3090 0.0136 38.4381 0.2849 78.8165 1.8837 26.9864 0.4938 28.8568 2.3768 33.3522 0.6860 10.9710 0.3531 24.1763 0.1056 4.7624 90.3301 64.6998 33.4124 3.9107 3.1906 16.0850 0.0017 116.0039 5.9523 67.7569 3.7337 0.6182 24.6643 28.3504 1.0984 3.2105 14.8122 1.8550 6.9182 1.0880 14.7456 0.8543 6.3371 9.7002 1.0342
temp: 298.150 k
press: 1.00000 atm
elementType: 8 8 7 7 6 6 6 6 6 6 6 6 6 6 6 6 6 6 6 6 1 1 1 1 1 1 1 1 1 1 1 1
symmnumber: 1
zpe: 631776.2 jmol-1
zpe.correction: 0.240631 hartree
zpe.thermalcorrener: 0.256765 hartree
zpe.thermalcorrenthalpy: 0.257709 hartree
zpe.thermalcorrgfe: 0.196335 hartree
zpe.sumelectzpe: -875.486956 hartree
zpe.sumelectthermal: -875.470822 hartree
zpe.sumelectthermalent: -875.469878 hartree
zpe.sumelectthermalfe: -875.531251 hartree
dipole: 0.0000 0.0000 0.5022
dipole: 0.5022
quadrupole: -95.5783 -112.3898 -117.2226
quadrupole: -14.9780 -0.0003 0.0000
quadrupole: 12.8186 -3.9929 -8.8257 -14.9780 -0.0003 0.0000
hfenergy: -875.7275865 hartree
pointgroup: C01 [X(C16H12N2O2)]
dipole: -0.0000024 0.0000064 -0.1975757 debye
polarizability: 379.4179401|11.6542054|172.3028469|-0.0002989|0.001308|94.198364 unknown
InChI: InChI=1S/C16H12N2O2/c1-9-17-13-5-3-11(7-15(13)19-9)12-4-6-14-16(8-12)20-10(2)18-14/h3-8H,1-2H3
charge 0 multiplicity 1
32 atoms
O  -4.171704 -1.191618 -0.466299
O  4.171708 1.19163 -0.466281
N  -4.890912 0.938201 0.116151
N  4.890919 -0.938209 0.116094
C  -0.726681 0.168547 0.197539
C  0.726688 -0.168556 0.19753
C  -3.028716 -0.423639 -0.143395
C  3.028721 0.42364 -0.143396
C  -1.689293 -0.816029 -0.165144
C  1.689298 0.816031 -0.165126
C  -3.471125 0.881996 0.208678
C  3.471132 -0.882006 0.208632
C  -1.163072 1.485074 0.558207
C  1.163081 -1.485095 0.558153
C  -2.521687 1.859218 0.567956
C  2.521696 -1.859239 0.567883
C  -5.265738 -0.268597 -0.274206
C  5.265743 0.268606 -0.274213
C  -6.630476 -0.799072 -0.539028
C  6.630481 0.799093 -0.539014
H  -1.390019 -1.818525 -0.481193
H  1.390023 1.818537 -0.481142
H  -0.412622 2.218924 0.87007
H  0.412633 -2.218955 0.869996
H  -2.834874 2.866794 0.854239
H  2.834884 -2.866825 0.854132
H  -6.723695 -1.148403 -1.582811
H  -6.855865 -1.657895 0.118097
H  -7.367478 -0.002881 -0.357775
H  6.855858 1.657909 0.118124
H  7.367486 0.002904 -0.357765
H  6.723709 1.148438 -1.582791
