program: Gaussian 09
title: 000237793
version: EM64L-G09RevD.01
frameworkgroup: C1[X(C15H18N2O3)]
method: RPBEPBE
basis: SDD
operation: Freq
keyword: #p
keyword: freq=noraman
keyword: PBEPBE/SDD
title: #p freq=noraman PBEPBE/SDD
converged: YES YES NO NO
title: Mulliken charges:
elementType: O O O N N C C C C C C C C C C C C C C C H H H H H H H H H H H H H H H H H H
charge: -0.228612 -0.219103 -0.220903 -0.380453 -0.376617 0.129992 -0.288872 -0.082399 0.164651 0.129059 0.468644 -0.757192 -0.739425 -0.742929 0.149672 -0.365299 -0.443897 -0.258006 -0.232545 -0.241242 0.268397 0.259010 0.258206 0.222864 0.226622 0.262489 0.210022 0.224227 0.230673 0.225596 0.235591 0.362183 0.361988 0.243411 0.255821 0.228001 0.229161 0.231216
chargesum: 0.00000
title: Mulliken charges with hydrogens summed into heavy atoms:
elementType: O O O N N C C C C C C C C C C C C C C C
charge: -0.228612 -0.219103 -0.220903 -0.018270 -0.014629 0.129992 -0.020475 0.176611 0.164651 0.129059 0.468644 -0.049499 -0.042687 -0.051070 0.149672 -0.121889 -0.188076 -0.030006 -0.003384 -0.010026
polarizability: 1.90399289e+02 -2.40179792e+01 1.66407498e+02 1.62533957e+00 2.10720507e+00 1.67521143e+02
1716.lowfreq: -8.9882 -0.0003 -0.0001 0.0008 7.5025 11.6008 28.6808 33.8728 64.1676
frequency: 28.4391 33.7776 64.0355 72.1537 100.7308 142.9277 151.6085 162.2194 171.8290 196.5159 202.7037 205.3012 216.5656 228.2832 245.1904 260.5382 290.9373 325.6923 357.4191 374.0270 382.4116 405.0436 418.1939 460.4933 483.6318 505.9517 532.1614 581.4682 590.2342 616.5123 640.0134 658.5023 670.7036 692.8214 702.1530 712.4869 761.2021 770.2466 782.4691 789.5007 861.0727 880.0062 926.2727 930.9590 934.4178 938.9011 964.3386 974.0113 984.2288 990.0957 998.3086 1000.5696 1019.0690 1037.2801 1065.9030 1080.8603 1109.7026 1142.6415 1145.4316 1174.1437 1178.2759 1195.6299 1208.8175 1216.6608 1273.5554 1294.5501 1316.4641 1325.3068 1333.7101 1350.9546 1370.8472 1376.1594 1377.8227 1382.7764 1388.3832 1399.0936 1405.3994 1443.4354 1464.3513 1469.4050 1470.8954 1483.4763 1485.6629 1488.7124 1494.4256 1590.1833 1601.7218 1611.8079 1637.9898 1679.9341 2975.9994 2989.0628 2999.0685 3010.4358 3014.7921 3069.9952 3073.0355 3078.1303 3087.7086 3101.7583 3107.9453 3121.5072 3125.6728 3138.0006 3146.9499 3163.7864 3517.5089 3518.9640
redmass: 5.4011 6.2879 3.5337 4.9336 2.8812 4.4442 4.8520 7.1857 4.1652 4.0635 1.2134 1.3161 2.4722 1.7445 1.8235 3.2113 3.0625 3.5876 9.7143 3.9060 9.1176 2.8475 2.6784 3.1166 10.1206 4.0303 3.5305 4.4742 6.1605 6.3585 4.3874 2.7149 2.6853 3.9211 3.7529 1.6808 1.9744 3.4024 2.0056 1.6990 1.2444 2.7667 1.3401 1.4541 1.7468 2.6113 1.6788 3.1613 1.3989 5.6728 2.3935 1.5354 2.5653 1.9137 2.1641 1.9622 1.8626 2.4824 2.6203 1.0674 2.0480 1.1422 3.4104 2.7309 1.7878 1.5759 1.3657 2.0199 1.4393 1.3851 7.3087 1.5169 2.3433 2.9768 1.4119 1.1996 1.2012 2.0623 1.0560 1.0694 1.0495 1.3945 1.4021 1.0554 1.0527 5.8165 6.2833 5.9316 8.1007 5.5860 1.0360 1.0371 1.0369 1.0841 1.0842 1.1000 1.0986 1.0980 1.0986 1.0991 1.0989 1.0852 1.0875 1.0918 1.0961 1.1014 1.0756 1.0781
irintensity: 0.4992 0.2832 0.0113 1.4816 0.0384 0.5000 1.6553 9.2814 0.4187 0.3330 1.2354 0.2873 2.3231 0.2711 0.2393 0.7739 2.6992 8.3969 25.5759 2.5211 2.3370 0.1422 4.7997 4.5170 13.8595 2.9556 26.1308 0.8122 0.5733 0.1805 9.7351 0.4122 20.3698 11.1488 9.5985 60.0581 2.9453 4.7413 28.8448 227.0442 0.8826 3.9689 6.0175 2.0771 3.1601 5.0490 3.9357 0.9239 0.6227 0.1050 2.5720 0.3125 13.1390 0.7249 7.7869 18.6213 18.7255 12.0843 9.4318 0.6575 11.4004 1.9499 35.2188 20.4006 136.4483 41.0528 13.2699 134.5849 26.5950 1.9761 201.8397 0.2597 5.1189 0.9833 11.4177 28.3372 25.4436 7.6332 6.0793 6.9779 3.2283 17.3314 6.0889 20.6758 10.7545 14.6628 211.3490 4.8418 90.0122 559.5992 23.8179 26.4725 20.4093 3.9817 4.4764 23.0732 14.4543 58.9503 30.5718 16.1955 14.6692 3.2981 0.1997 11.1876 29.4743 22.1248 81.8833 40.1825
temp: 298.150 k
press: 1.00000 atm
elementType: 8 8 8 7 7 6 6 6 6 6 6 6 6 6 6 6 6 6 6 6 1 1 1 1 1 1 1 1 1 1 1 1 1 1 1 1 1 1
symmnumber: 1
zpe: 805697.1 jmol-1
zpe.correction: 0.306874 hartree
zpe.thermalcorrener: 0.325904 hartree
zpe.thermalcorrenthalpy: 0.326848 hartree
zpe.thermalcorrgfe: 0.259976 hartree
zpe.sumelectzpe: -916.149848 hartree
zpe.sumelectthermal: -916.130817 hartree
zpe.sumelectthermalent: -916.129873 hartree
zpe.sumelectthermalfe: -916.196745 hartree
dipole: 0.1983 -1.1142 -0.0241
dipole: 1.1320
quadrupole: -109.1972 -128.0258 -122.6654
quadrupole: -0.4493 -0.1353 0.5833
quadrupole: 10.7656 -8.0630 -2.7026 -0.4493 -0.1353 0.5833
hfenergy: -916.4567214 hartree
pointgroup: C01 [X(C15H18N2O3)]
dipole: 0.1375061 -0.4186543 -0.064523 debye
polarizability: 196.4848531|-19.8453031|159.8460044|-1.2931011|1.3216313|167.9970724 unknown
InChI: InChI=1S/C15H18N2O3/c1-9(2)15(10(3)11-7-5-4-6-8-11)12(18)16-14(20)17-13(15)19/h4-10,16-17H,1-3H3
charge 0 multiplicity 1
38 atoms
O  1.065906 0.369099 -2.351984
O  1.105173 -0.156688 2.503036
O  -0.605634 3.640402 0.47185
N  0.298245 1.975108 -0.898211
N  0.231812 1.682936 1.436865
C  1.189667 -0.197562 0.041935
C  0.325115 -1.532183 -0.174809
C  2.756084 -0.488559 0.071671
C  0.860358 0.713019 -1.156702
C  0.846784 0.419481 1.41126
C  -1.179359 -1.219102 -0.190775
C  0.674837 -2.675205 0.804519
C  3.280895 -1.339092 -1.105785
C  3.558467 0.834543 0.169488
C  -0.068284 2.51303 0.345385
C  -1.931009 -1.086631 1.007507
C  -1.854167 -1.064437 -1.430229
C  -3.314042 -0.803216 0.965456
C  -3.23819 -0.781747 -1.474969
C  -3.97415 -0.6478 -0.27559
H  0.603167 -1.853848 -1.195952
H  2.912252 -1.047475 1.01434
H  0.516275 -2.390149 1.856523
H  1.727144 -2.99058 0.702274
H  0.0356 -3.547367 0.577384
H  3.127487 -0.831104 -2.072095
H  4.365402 -1.506536 -0.967112
H  2.799561 -2.330646 -1.164117
H  3.454846 1.43931 -0.750902
H  4.632545 0.609732 0.296196
H  3.249106 1.452624 1.032523
H  0.073833 2.55246 -1.715457
H  -0.013471 2.055801 2.360051
H  -1.440446 -1.219105 1.978837
H  -1.289097 -1.166742 -2.364739
H  -3.877158 -0.707875 1.900796
H  -3.739634 -0.67003 -2.442927
H  -5.047522 -0.430068 -0.306942
