program: Gaussian 09
title: 000237755
version: EM64L-G09RevD.01
frameworkgroup: C1[X(C4H5Cl4NO2)]
method: RPBEPBE
basis: SDD
operation: Freq
keyword: #p
keyword: freq=noraman
keyword: PBEPBE/SDD
title: #p freq=noraman PBEPBE/SDD
converged: YES YES NO NO
title: Mulliken charges:
elementType: Cl Cl Cl Cl O O N C C C C H H H H H
charge: 0.140047 0.112498 0.115471 -0.057168 -0.379163 -0.255146 -0.327042 -0.020419 -0.610232 0.318851 -0.663553 0.305031 0.348181 0.303048 0.298671 0.370925
chargesum: 0.00000
title: Mulliken charges with hydrogens summed into heavy atoms:
elementType: Cl Cl Cl Cl O O N C C C C
charge: 0.140047 0.112498 0.115471 -0.057168 -0.008238 -0.255146 0.021140 0.284612 -0.610232 0.318851 -0.061834
polarizability: 1.06344058e+02 -4.57938102e+00 9.98322857e+01 -1.08762627e+01 -6.04177355e+00 7.62991728e+01
1716.lowfreq: -5.2244 -0.0030 -0.0026 -0.0017 5.9379 8.8073 24.4232 46.0283 48.2728
frequency: 24.3943 45.9878 48.2667 79.1997 123.4351 166.1543 179.7813 197.1301 216.5565 250.5911 253.1154 293.7433 344.0542 375.5922 403.2958 471.4450 546.6979 572.4089 621.5053 693.9048 719.4576 744.1848 752.2834 908.2208 938.3320 994.5697 1004.5964 1110.8574 1156.4920 1220.4933 1232.7241 1260.6601 1331.1219 1380.3194 1417.0220 1487.2574 1605.1491 3026.6922 3069.7913 3150.8229 3485.2576 3580.1783
redmass: 9.5693 12.8462 16.8419 3.0354 12.9562 8.3829 13.2192 2.2712 1.9103 14.9606 15.8352 12.0000 10.9750 14.2049 8.4578 4.4434 6.2652 3.2599 4.2496 6.3865 1.3445 7.5084 9.5656 1.7643 7.5313 4.0172 5.4466 5.9967 1.1179 1.1786 1.8665 1.1904 1.4376 1.3318 1.0887 1.9593 8.4649 1.0848 1.0569 1.1086 1.0777 1.0668
irintensity: 0.3150 2.2819 2.5877 13.4376 0.6886 1.6978 0.6158 60.3961 80.1515 3.2944 3.7182 7.5131 5.3568 0.5048 19.5743 23.9786 30.9557 3.3868 6.7761 135.4059 128.1977 201.1061 95.0334 10.6178 22.8641 111.6679 38.2731 44.9064 0.6427 27.2743 14.4858 19.5119 54.9422 9.0537 43.1323 379.5838 169.6286 16.2364 2.4594 0.3720 60.5713 26.2162
temp: 298.150 k
press: 1.00000 atm
elementType: 17 17 17 17 8 8 7 6 6 6 6 1 1 1 1 1
symmnumber: 1
zpe: 248127.9 jmol-1
zpe.correction: 0.094507 hartree
zpe.thermalcorrener: 0.107555 hartree
zpe.thermalcorrenthalpy: 0.108499 hartree
zpe.thermalcorrgfe: 0.052036 hartree
zpe.sumelectzpe: -2199.995782 hartree
zpe.sumelectthermal: -2199.982734 hartree
zpe.sumelectthermalent: -2199.981790 hartree
zpe.sumelectthermalfe: -2200.038253 hartree
dipole: -1.7959 -0.6194 -0.8341
dipole: 2.0748
quadrupole: -91.5193 -97.4009 -89.0745
quadrupole: -0.5871 0.0821 4.2655
quadrupole: 1.1456 -4.7360 3.5904 -0.5871 0.0821 4.2655
hfenergy: -2200.0902892 hartree
pointgroup: C01 [X(C4H5Cl4N1O2)]
dipole: -0.6671321 -0.3638554 -0.2981111 debye
dipolederiv: -0.613157 0.2587146 -0.176412 0.2187813 -0.2712885 0.1047927 -0.226354 0.1380826 -0.2017449 -0.2922877 0.1416421 0.1798894 0.1556873 -0.3298963 -0.2481605 0.1921031 -0.2200778 -0.4346855 -0.2165679 -0.0625235 0.0806051 -0.1011898 -0.2898002 0.2951668 0.0857533 0.2402627 -0.5565436 -0.2458753 0.0073901 -0.00066 0.1158214 -0.3252811 0.2142241 -0.1357046 0.2289948 -0.4130244 -0.5697529 0.2196719 -0.0908257 0.3446584 -0.5773199 -0.2495998 0.0225125 -0.3261103 -0.5610912 -0.7412628 0.0819192 -0.1068287 -0.2307542 -0.6381564 0.3222466 0.2800853 0.2934398 -0.6422172 -1.6219476 -0.0443721 0.1111126 -0.0638433 -0.5460957 -0.0586521 -0.0588492 -0.0028383 -0.4576295 0.9342111 -0.1197151 0.0942677 -0.3935728 0.5805483 0.349239 0.3350654 0.4078927 0.3287813 1.0700085 -0.3771689 -0.1531171 -0.2800774 0.9123941 -0.1955547 -0.0804105 -0.172059 1.2868466 1.6015301 -0.024874 0.0050813 0.3884977 0.5532117 -0.3985105 -0.5778386 -0.3803836 0.5615415 -0.1087462 0.1376961 -0.1294306 -0.0215712 0.3573785 -0.2676643 0.0874855 -0.2889451 0.5192281 0.110987 -0.0236224 0.0750943 0.0340719 0.0332459 0.0238295 -0.0655673 -0.053575 0.0002803 0.299475 -0.0190354 0.0820634 0.0168521 0.2907909 0.048958 0.0836263 0.0500182 0.2664418 0.0954875 0.0261042 0.0162389 0.0468464 0.031012 0.0278508 0.0430615 0.0005423 -0.0284016 0.0602372 -0.0392486 -0.0322723 -0.0756064 0.002182 0.0268992 -0.0381907 0.0543685 0.0287319 0.237661 -0.1625782 0.0451935 -0.1546013 0.2170748 0.0049351 0.0532221 0.0303875 0.3034865 unknown
polarizability: 107.2713158|-7.5990883|84.2547666|-0.9392321|-15.059621|90.9494345 unknown
InChI: InChI=1S/C4H5Cl4NO2/c5-1-2(10)9-3(11)4(6,7)8/h3,9,11H,1H2
charge 0 multiplicity 1
16 atoms
Cl 3.253653 -0.451948 1.087705
Cl 1.00579 1.461894 1.717506
Cl 2.201265 1.399749 -1.068707
Cl -2.713466 1.338626 -1.998477
O  1.334256 -1.540351 -0.996361
O  -1.917006 -1.331546 0.964086
N  -0.53762 -0.109508 -0.474416
C  0.692786 -0.714911 0.01201
C  1.741576 0.360338 0.406829
C  -1.764189 -0.476355 0.040513
C  -3.01441 0.193072 -0.527343
H  0.429332 -1.287841 0.92314
H  -0.492413 0.553689 -1.25675
H  -3.484468 0.810654 0.252498
H  -3.718263 -0.578373 -0.870681
H  0.882481 -2.420785 -1.030451
