program: Gaussian 09
title: 000237768
version: EM64L-G09RevD.01
frameworkgroup: C1[X(C11H17FO7)]
method: RPBEPBE
basis: SDD
operation: Freq
keyword: #p
keyword: freq=noraman
keyword: PBEPBE/SDD
title: #p freq=noraman PBEPBE/SDD
converged: YES YES NO NO
title: Mulliken charges:
elementType: F O O O O O O O C C C C C C C C C C C H H H H H H H H H H H H H H H H H
charge: -0.203609 -0.295023 -0.255785 -0.256370 -0.276543 -0.515412 -0.445200 -0.235291 -0.112039 -0.192955 -0.106091 -0.046347 -0.013866 0.370962 -0.383365 -0.689984 -0.689293 0.298838 -0.287533 0.231728 0.302339 0.259195 0.248501 0.234103 0.233814 0.188084 0.220689 0.260870 0.218447 0.233564 0.231803 0.222423 0.389038 0.375314 0.239324 0.245669
chargesum: 0.00000
title: Mulliken charges with hydrogens summed into heavy atoms:
elementType: F O O O O O O O C C C C C C C C C C C
charge: -0.203609 -0.295023 -0.255785 -0.256370 -0.276543 -0.126374 -0.069887 -0.235291 0.119689 0.109385 0.153104 0.202155 0.220237 0.370962 0.038533 0.010022 -0.001503 0.298838 0.197460
polarizability: 1.72105739e+02 -3.92755863e+00 1.32007466e+02 1.14547566e+00 1.96955976e+00 1.16053208e+02
1716.lowfreq: -12.8979 -9.1135 -7.0101 -0.0009 -0.0006 -0.0005 31.5854 36.8931 45.9834
frequency: 31.5158 36.8163 45.9301 51.1452 62.7853 93.8990 111.6943 127.4039 158.5716 171.9610 175.6460 198.1817 218.6795 237.8408 241.9014 261.1878 284.7302 329.0304 340.5358 353.9327 357.6295 377.2673 398.3125 419.7846 437.5351 478.1411 484.2959 541.6567 559.6708 585.4009 615.1642 649.7997 662.8918 706.3514 721.9896 751.4332 765.0115 809.3130 840.6301 877.4591 906.8943 926.4662 934.6328 945.2069 971.5342 985.6715 990.4935 1002.5284 1007.7770 1014.7013 1017.2095 1041.7512 1047.5170 1085.4206 1117.0539 1127.8512 1137.6259 1148.1154 1168.8641 1183.0262 1212.8496 1240.2900 1247.3619 1248.2277 1259.9773 1270.7025 1281.5621 1295.8704 1302.9127 1320.0213 1325.3654 1347.2140 1360.2862 1363.5563 1380.7208 1392.4512 1403.8465 1419.0482 1433.6814 1447.6678 1454.3002 1466.8012 1475.0427 1477.8864 1659.9980 2954.6023 2976.7127 2984.2620 2992.3714 3000.8676 3004.5252 3017.9194 3035.5245 3036.3695 3084.1469 3087.7359 3100.2054 3108.3491 3110.0876 3122.8042 3440.6035 3475.2117
redmass: 4.6268 5.2834 4.1115 3.5863 6.4662 5.1849 6.6185 4.1328 4.7038 1.0400 6.5013 3.8418 1.2652 3.2299 5.1606 4.0064 9.2319 3.3036 4.0437 4.0473 3.9401 3.6570 4.0227 3.7792 1.5277 3.3266 4.2299 3.1271 4.0330 1.1551 5.3740 5.2991 6.6508 5.1910 5.2961 5.2774 5.7207 3.4767 4.1599 6.0557 2.5162 1.4700 3.6938 2.2271 6.6154 1.3740 4.6055 4.1813 2.0386 4.0281 7.6210 5.3639 4.1418 2.0037 2.6693 1.8446 3.6656 2.0345 1.1800 1.0772 2.3884 1.4146 1.2821 3.3637 1.2909 1.1494 1.3798 1.2663 1.3512 1.4460 1.2047 1.3652 1.4443 1.5245 1.2931 1.2270 1.3845 1.3366 1.0754 1.0503 1.0484 1.0616 1.0506 1.0885 10.5797 1.0703 1.0813 1.0840 1.0846 1.0354 1.0358 1.0560 1.0862 1.0876 1.1071 1.0948 1.0999 1.0998 1.1004 1.1010 1.0660 1.0670
irintensity: 9.9463 9.8416 5.4122 4.2274 1.8610 10.2538 1.5751 1.7896 1.7870 0.0213 7.2457 5.7351 1.1849 4.4836 2.8548 0.9799 4.9994 0.7612 12.3358 13.6129 27.3768 4.6728 8.7025 8.1060 143.4280 34.6889 28.2111 10.1272 11.3646 164.2033 3.7903 6.4234 8.8864 15.3661 11.7615 40.3473 22.8585 35.3303 14.9665 1.6802 24.0846 0.1417 42.7856 4.4244 206.2309 4.7703 14.5151 28.8863 8.7168 147.8054 245.8469 113.0063 38.9267 45.3673 29.4796 15.8019 360.1122 6.0998 1.0493 1.7153 134.4178 19.6855 4.8120 50.5727 1.2810 10.4408 3.0419 5.5215 4.5553 0.3502 6.2419 13.2284 12.5059 4.1976 47.3039 31.6431 10.0045 95.5398 21.9346 2.1469 2.5112 2.4072 15.0734 5.9729 159.9463 36.8058 9.0198 19.7750 74.9558 8.7421 14.9686 14.4060 17.1404 31.7516 6.9787 25.1524 2.2022 25.0428 21.8833 13.5791 96.1218 72.4436
temp: 298.150 k
press: 1.00000 atm
elementType: 9 8 8 8 8 8 8 8 6 6 6 6 6 6 6 6 6 6 6 1 1 1 1 1 1 1 1 1 1 1 1 1 1 1 1 1
symmnumber: 1
zpe: 735424.7 jmol-1
zpe.correction: 0.280108 hartree
zpe.thermalcorrener: 0.299759 hartree
zpe.thermalcorrenthalpy: 0.300704 hartree
zpe.thermalcorrgfe: 0.231103 hartree
zpe.sumelectzpe: -1054.231837 hartree
zpe.sumelectthermal: -1054.212186 hartree
zpe.sumelectthermalent: -1054.211242 hartree
zpe.sumelectthermalfe: -1054.280843 hartree
dipole: 2.6065 -4.4398 -0.5699
dipole: 5.1798
quadrupole: -122.8490 -123.3878 -110.4819
quadrupole: 0.4795 11.0191 7.7807
quadrupole: -3.9428 -4.4816 8.4243 0.4795 11.0191 7.7807
hfenergy: -1054.5119455 hartree
pointgroup: C01 [X(C11H17F1O7)]
dipole: -0.3108887 2.0083394 0.1515115 debye
polarizability: 152.26567|20.344299|151.8958949|-2.6097792|-0.3261654|116.004849 unknown
InChI: InChI=1S/C11H17FO7/c1-11(2)18-9-8(17-6(14)3-12)7(15)5(4-13)16-10(9)19-11/h5,7-10,13,15H,3-4H2,1-2H3
charge 0 multiplicity 1
36 atoms
F  -5.041224 -1.982198 0.417832
O  0.75991 1.905683 -0.949356
O  1.897042 -0.247774 0.857634
O  1.87555 2.09609 1.143584
O  -1.769284 -0.410247 0.396577
O  -0.311071 -2.423077 -1.184334
O  1.364823 -3.910777 0.410364
O  -2.954595 -1.432236 -1.343823
C  -0.012955 1.205489 0.091033
C  -0.671885 -0.020196 -0.558078
C  1.055383 0.917108 1.182362
C  0.327354 -1.176733 -0.753275
C  1.099888 -1.459085 0.554842
C  1.909436 2.596026 -0.274514
C  2.080429 -2.637026 0.422376
C  3.199279 2.167611 -0.970548
C  1.667123 4.103106 -0.222494
C  -2.866578 -1.072309 -0.152513
C  -3.912423 -1.259868 0.939047
H  -0.799956 1.86397 0.511413
H  -1.144428 0.26407 -1.516987
H  0.648853 0.817183 2.204827
H  1.058881 -0.835283 -1.515883
H  0.385252 -1.677408 1.376736
H  2.740903 -2.658627 1.304079
H  2.705637 -2.504816 -0.487069
H  4.062694 2.673322 -0.505561
H  3.330571 1.078795 -0.873762
H  3.159669 2.443025 -2.038882
H  0.683537 4.319804 0.226198
H  2.447821 4.586972 0.389108
H  1.698314 4.528216 -1.239889
H  -1.125413 -2.241102 -1.72666
H  0.658953 -3.836159 -0.291056
H  -4.257512 -0.274895 1.30251
H  -3.475777 -1.834353 1.775964
