program: Gaussian 09
title: 000021274
version: EM64L-G09RevD.01
frameworkgroup: C1[X(C4H5N3O2)]
method: RPBEPBE
basis: SDD
operation: Freq
keyword: #pfreq=noraman
keyword: PBEPBE/SDD
title: #p freq=noraman PBEPBE/SDD
converged: NO YES YES YES
title: Mulliken charges:
elementType: O O N N N C C C C H H H H H
charge: -0.169794 -0.252989 -0.421174 0.001811 0.079295 0.409286 0.139797 -0.397722 -0.768487 0.354054 0.274607 0.248074 0.255200 0.248042
chargesum: 0.00000
title: Mulliken charges with hydrogens summed into heavy atoms:
elementType: O O N N N C C C C
charge: -0.169794 -0.252989 -0.067120 0.001811 0.079295 0.409286 0.139797 -0.123115 -0.017172
polarizability: 1.18239409e+02 -9.15497015e-01 7.76126296e+01 1.76299179e-04 4.83222667e-03 3.41619961e+01
1716.lowfreq: -2.2061 0.0003 0.0005 0.0006 6.6920 7.3970 82.6636 106.7713 155.9844
frequency: 82.6588 106.7591 155.9841 180.6310 290.2143 329.3489 412.1240 525.9797 612.5133 645.1254 658.0416 702.2686 747.3929 759.3002 838.5816 947.3950 983.6998 1009.5916 1044.5589 1119.4040 1170.0782 1216.1024 1281.3562 1355.8792 1359.4370 1395.1297 1412.8989 1415.0056 1468.2488 1476.1517 1543.9313 2985.6019 3062.3590 3108.8592 3235.0165 3566.1623
redmass: 4.6993 1.1509 4.8572 5.3263 4.3554 3.6171 7.7813 7.7731 7.6620 3.5831 4.7746 11.3731 12.1984 1.1548 1.3185 4.8778 1.5126 4.3999 1.4870 2.8576 2.4544 2.4746 2.5983 5.0192 6.0747 2.7482 8.9003 1.6683 1.0424 1.1528 4.4004 1.0387 1.0984 1.0972 1.0993 1.0819
irintensity: 1.5342 0.0888 1.7099 2.4719 0.5349 1.0795 1.0822 0.2745 0.2145 12.5649 2.3157 3.4634 19.3095 97.4750 42.9189 9.6464 6.3518 15.7760 9.5673 45.7423 101.4956 196.4454 38.3830 32.6709 136.0377 76.0767 24.3789 54.1308 17.7249 9.1387 58.8667 19.3235 12.7383 8.4136 3.9434 83.1038
temp: 298.150 k
press: 1.00000 atm
elementType: 8 8 7 7 7 6 6 6 6 1 1 1 1 1
symmnumber: 1
zpe: 258416.1 jmol-1
zpe.correction: 0.098425 hartree
zpe.thermalcorrener: 0.106355 hartree
zpe.thermalcorrenthalpy: 0.107299 hartree
zpe.thermalcorrgfe: 0.065306 hartree
zpe.sumelectzpe: -469.368937 hartree
zpe.sumelectthermal: -469.361007 hartree
zpe.sumelectthermalent: -469.360063 hartree
zpe.sumelectthermalfe: -469.402057 hartree
dipole: -6.9605 -2.4774 -0.0008
dipole: 7.3882
quadrupole: -53.5935 -54.0322 -51.4758
quadrupole: 1.2268 -0.0019 0.0012
quadrupole: -0.5597 -0.9984 1.5580 1.2268 -0.0019 0.0012
hfenergy: -469.4673623 hartree
pointgroup: C01 [X(C4H5N3O2)]
dipole: 2.7220195 1.0197291 -0.0003292 debye
dipolederiv: -0.8734143 -0.2077571 -0.0000588 -0.2863658 -0.5183191 -0.0000929 0.0002508 0.0001386 -0.1943012 -0.5827769 0.0748193 -0.0000104 0.3298319 -0.8313538 0.0001513 0.0000989 -0.0001483 -0.2640912 0.0584992 0.0267282 -0.0000202 0.0628051 -0.5911129 0.0000599 -0.0000835 0.0000667 -0.1838581 0.2418517 -0.0785612 0.0000026 -0.3343599 -0.2885962 0.0000645 -0.0000595 0.000029 -0.1857187 2.0026492 -0.0577554 0.0000338 -0.2376623 1.1539181 -0.0000328 -0.0001873 -0.0000116 0.1916651 0.2045362 -0.015619 0.000017 0.7264123 0.2679363 -0.0000441 0.000061 0.0000663 0.0179667 -0.8973414 0.1991107 0.0000026 0.500098 0.2838213 -0.0000511 -0.0000656 -0.0000424 0.0992172 -0.4060805 -0.0033505 0.0000799 -0.6288478 0.1465755 -0.0000829 0.0001292 -0.0000549 -0.1829403 -0.058074 -0.0087697 0.0000089 -0.2001303 -0.0088407 -0.000012 -0.0002971 -0.000073 0.0812766 0.2416269 0.0213753 -0.0000057 -0.0183987 0.2585863 0.0000066 0.0000012 0.0000023 0.3490931 0.0278827 0.0538916 -0.000018 0.0696128 0.0676252 0.0000319 0.0000219 -0.0000014 0.186465 0.0207512 -0.0260526 0.0155651 -0.0575343 0.0296267 -0.1011771 -0.0446483 -0.1134513 -0.0227351 -0.0009087 0.0478788 0.0000665 0.1319671 0.0006704 -0.0000905 0.0001218 -0.0000402 0.1305378 0.0207988 -0.0259384 -0.0156634 -0.057428 0.0294631 0.1012693 0.0446564 0.1135202 -0.022577 unknown
polarizability: 118.2585565|-0.2446772|77.5934821|-0.0000965|-0.0048345|34.1619961 unknown
InChI: InChI=1S/C4H5N3O2/c1-3-2-5-4(6-3)7(8)9/h2,6H,1H3
charge 0 multiplicity 1
14 atoms
O  -2.736969 -0.681324 0.0002
O  -2.028361 1.507318 0.000057
N  0.557559 0.792145 -0.000192
N  0.074458 -1.428605 0.000034
N  -1.819297 0.214929 -0.000259
C  1.78588 0.137167 -0.000075
C  -0.432161 -0.182802 -0.000119
C  1.453493 -1.238339 0.000249
C  3.106751 0.843762 -0.000104
H  0.361497 1.794897 -0.000335
H  2.136136 -2.085105 0.000456
H  3.230977 1.483556 0.893213
H  3.924705 0.106128 -0.000636
H  3.230532 1.484374 -0.892891
