program: Gaussian 09
title: 000237751
version: EM64L-G09RevD.01
frameworkgroup: C1[X(C11H15ClS2)]
method: RPBEPBE
basis: SDD
operation: Freq
keyword: #p
keyword: freq=noraman
keyword: PBEPBE/SDD
title: #p freq=noraman PBEPBE/SDD
converged: YES YES NO NO
title: Mulliken charges:
elementType: Cl S S C C C C C C C C C C C H H H H H H H H H H H H H H H
charge: -0.055937 0.206320 0.206143 -0.969246 0.596849 -0.428315 -0.299228 -0.581661 -0.581497 -0.203625 -0.209790 -0.114630 -0.653447 -0.653443 0.317822 0.240540 0.271853 0.267991 0.247672 0.247653 0.267887 0.256329 0.255813 0.230758 0.231603 0.221592 0.231627 0.230773 0.221594
chargesum: 0.00000
title: Mulliken charges with hydrogens summed into heavy atoms:
elementType: Cl S S C C C C C C C C C C C
charge: -0.055937 0.206320 0.206143 -0.651424 0.596849 -0.187775 -0.027375 -0.065999 -0.065957 0.052704 0.046022 -0.114630 0.030507 0.030551
polarizability: 2.02646212e+02 -1.72319874e-02 1.68569146e+02 -5.53164343e+00 -4.81690847e-02 1.30438908e+02
1716.lowfreq: -6.7120 -0.0025 0.0010 0.0020 7.3679 8.8970 20.2072 29.3267 35.7886
frequency: 19.6676 29.0939 35.7769 49.7137 60.9891 67.9822 73.9993 126.0433 134.2916 184.7880 207.7171 232.0841 235.8516 239.8821 295.4532 307.1260 348.1138 370.5909 405.9710 431.2587 509.5107 613.5406 621.8524 629.0493 637.8996 671.9629 722.7734 730.7104 791.0319 793.0074 824.0040 824.5876 837.4694 946.5814 961.7349 994.3731 995.6131 998.0527 1031.6517 1035.6775 1060.8433 1069.7021 1070.7234 1103.1981 1141.2454 1178.8323 1201.2615 1226.8690 1238.7521 1239.7753 1275.7800 1277.4102 1296.0295 1379.8014 1393.1212 1395.7381 1395.7989 1459.7356 1460.4799 1470.4637 1470.5249 1472.2997 1483.6313 1483.7102 1581.6862 1594.0083 2986.8061 2986.9796 3011.3609 3011.7414 3032.2276 3075.1016 3075.3631 3081.3365 3081.4085 3101.8551 3102.1388 3126.4336 3148.9977 3169.0084 3172.2900
redmass: 3.5858 4.8012 3.5714 1.9273 1.8780 8.4703 3.5755 5.9405 9.9046 5.3981 6.3359 2.4463 1.1091 1.5044 4.6500 4.4353 6.4153 5.3817 2.9460 8.7364 3.2899 6.7642 4.5066 4.9826 6.9541 5.6737 5.9811 3.1368 1.1089 1.1174 1.2483 5.3297 1.6935 1.3510 1.3714 1.7734 1.9056 3.9972 1.2011 1.2063 2.1878 2.4397 2.4531 1.3715 1.1266 1.1205 1.8983 1.7216 1.2380 1.2339 1.2578 1.2570 1.2819 5.5133 2.9610 1.2025 1.2048 1.0862 1.0892 1.0406 1.0459 2.3685 1.0481 1.0479 7.2526 6.3746 1.0353 1.0353 1.0571 1.0574 1.0865 1.1045 1.1045 1.0988 1.0987 1.1048 1.1048 1.0897 1.0886 1.0954 1.0968
irintensity: 0.0009 0.4338 1.4501 0.0081 1.7714 0.0404 0.6294 0.0124 3.7862 0.0494 0.3553 1.0905 0.0090 0.8243 0.2600 0.7303 5.5205 3.0947 0.1066 18.5026 19.3071 0.4113 4.3853 0.0414 4.8192 25.3433 2.8351 30.2304 0.1646 16.5506 0.0840 28.2701 32.7112 0.0922 0.0026 30.6257 6.0796 33.6784 1.3324 0.6156 10.2185 17.7445 25.0210 12.5151 38.3199 0.2996 2.3590 4.4409 0.5987 1.6677 20.3450 5.0251 1.8577 1.5873 12.0911 22.7032 10.6948 12.1558 6.9860 6.8759 28.9609 56.7943 3.2207 12.1192 3.4693 20.0726 64.1322 8.1702 3.1598 33.8492 11.6642 0.0906 0.1990 17.1174 31.3777 4.0543 81.8964 10.3264 1.3268 5.5122 0.6103
temp: 298.150 k
press: 1.00000 atm
elementType: 17 16 16 6 6 6 6 6 6 6 6 6 6 6 1 1 1 1 1 1 1 1 1 1 1 1 1 1 1
symmnumber: 1
zpe: 601793.1 jmol-1
zpe.correction: 0.229211 hartree
zpe.thermalcorrener: 0.246145 hartree
zpe.thermalcorrenthalpy: 0.247089 hartree
zpe.thermalcorrgfe: 0.180654 hartree
zpe.sumelectzpe: -1683.277222 hartree
zpe.sumelectthermal: -1683.260288 hartree
zpe.sumelectthermalent: -1683.259344 hartree
zpe.sumelectthermalfe: -1683.325780 hartree
dipole: -0.1416 -0.0031 2.3431
dipole: 2.3474
quadrupole: -123.5518 -96.5400 -99.7795
quadrupole: -0.0856 3.2509 -0.0105
quadrupole: -16.9280 10.0838 6.8443 -0.0856 3.2509 -0.0105
hfenergy: -1683.5064333 hartree
pointgroup: C01 [X(C11H15Cl1S2)]
dipole: 0.0475703 -0.0006305 -0.9223186 debye
polarizability: 202.5410408|0.2618648|168.5711242|-6.1677183|0.0143123|130.5421007 unknown
InChI: InChI=1S/C11H15ClS2/c1-3-13-11(14-4-2)9-5-7-10(12)8-6-9/h5-8,11H,3-4H2,1-2H3
charge 0 multiplicity 1
29 atoms
Cl 4.657608 0.024426 0.230537
S  -2.318549 1.489839 0.528011
S  -2.303314 -1.51167 0.530166
C  -1.473784 -0.007282 -0.298506
C  0.030177 0.000402 -0.156993
C  0.85125 0.004227 -1.312562
C  0.647976 0.004076 1.121874
C  -1.49826 2.875691 -0.481826
C  -1.476969 -2.890039 -0.484961
C  2.262664 0.011567 -1.206571
C  2.051578 0.011436 1.247157
C  2.839185 0.01505 0.075738
C  -2.029862 4.228779 0.014518
C  -1.99508 -4.247758 0.013031
H  -1.7740 -0.009583 -1.360892
H  0.392124 0.001538 -2.308472
H  0.016549 0.001052 2.016272
H  -0.406709 2.795101 -0.344865
H  -1.745993 2.711937 -1.545313
H  -1.731417 -2.727461 -1.547037
H  -0.385396 -2.800836 -0.353492
H  2.893314 0.014455 -2.100186
H  2.527567 0.014274 2.232181
H  -3.124926 4.301426 -0.10882
H  -1.79061 4.384521 1.081394
H  -1.565302 5.049404 -0.56271
H  -1.749149 -4.402277 1.078564
H  -3.090139 -4.3292 -0.104793
H  -1.526831 -5.064196 -0.567144
