program: Gaussian 09
title: 000237730
version: EM64L-G09RevD.01
frameworkgroup: C1[X(C13H16ClNO3)]
method: RPBEPBE
basis: SDD
operation: Freq
keyword: #p
keyword: freq=noraman
keyword: PBEPBE/SDD
title: #p freq=noraman PBEPBE/SDD
converged: YES YES NO NO
title: Mulliken charges:
elementType: Cl O O O N C C C C C C C C C C C C C H H H H H H H H H H H H H H H H
charge: -0.066458 -0.298635 -0.265987 -0.248982 -0.450731 0.044657 0.234032 0.490884 -0.334949 -0.342008 -0.447989 -0.334987 -0.686644 -0.683811 0.186424 -0.498135 0.215856 -0.560315 0.232588 0.209461 0.233362 0.222066 0.212714 0.254015 0.219771 0.272386 0.271683 0.225027 0.309060 0.311240 0.269810 0.235937 0.269760 0.298895
chargesum: 0.00000
title: Mulliken charges with hydrogens summed into heavy atoms:
elementType: Cl O O O N C C C C C C C C C C C C C
charge: -0.066458 -0.298635 -0.265987 -0.248982 -0.139491 0.277245 0.234032 0.490884 -0.062563 -0.070325 -0.222962 -0.025927 -0.021756 0.002689 0.186424 0.007613 0.215856 0.008341
polarizability: 3.01193668e+02 7.41632339e-01 1.57769932e+02 5.24879172e+00 -2.35253790e+00 9.27172611e+01
1716.lowfreq: -9.0599 -3.7915 -1.4121 -0.0019 -0.0012 0.0011 18.5654 29.5263 39.0341
frequency: 18.4894 29.5186 39.0020 45.9063 56.8751 67.6673 81.2526 91.6604 112.6699 154.6852 173.7645 193.0476 200.2923 230.6205 254.6674 271.7494 313.7558 323.8805 352.6599 388.7422 411.2319 412.7827 443.6058 494.4238 512.0367 569.5375 607.9942 629.1541 660.1036 668.4089 680.1215 752.4112 760.1927 780.5929 784.4781 799.1173 836.1664 844.6140 882.5791 904.6821 927.3558 931.8539 940.2353 983.0952 989.8824 1005.2467 1008.7651 1062.5328 1072.5586 1104.0954 1117.1840 1121.8404 1156.2873 1177.6929 1178.5293 1186.7930 1248.5459 1250.4698 1261.3996 1282.7957 1305.6914 1327.1663 1334.3605 1337.8316 1374.1514 1381.5286 1397.8509 1419.2705 1446.4820 1457.3908 1461.4959 1464.8543 1473.0875 1488.1454 1494.4663 1505.4090 1585.0869 1609.3466 1618.7229 1627.5801 2989.6750 2992.9867 2995.6834 3027.5543 3054.8844 3076.9616 3084.6167 3093.3208 3098.7144 3105.4850 3116.6956 3163.5617 3165.5950 3172.2753 3199.8453 3521.0247
redmass: 6.3732 3.1188 2.6949 5.4426 3.8148 6.1527 4.6009 5.4573 4.8783 5.2490 5.8238 1.0433 4.6256 1.6708 2.1605 6.0250 5.0153 3.7500 4.8238 4.6110 3.0863 2.9814 3.4104 3.7479 2.9507 3.6953 5.7777 7.0748 1.2028 6.7764 4.1918 3.8706 4.3598 3.2574 1.9506 3.2127 5.2668 1.4006 1.5073 2.5837 1.2339 6.3440 1.3750 1.3612 1.5470 3.3751 1.3340 5.1647 3.9252 1.7164 1.2213 1.3320 2.0515 1.8601 1.7321 1.3672 2.2814 1.2479 2.2878 1.2120 1.4131 1.5893 1.5534 1.3138 4.6141 1.2628 1.2288 4.5471 1.0888 1.0518 1.0930 1.0480 1.0517 1.0520 2.1224 2.9848 6.0268 9.7839 4.9166 5.9034 1.0357 1.0360 1.0596 1.0864 1.1012 1.0580 1.0994 1.0987 1.1005 1.1007 1.0899 1.0947 1.1108 1.0907 1.0957 1.0764
irintensity: 0.0405 1.8693 0.0890 0.4499 2.0769 9.6989 2.4692 0.4529 3.7560 3.2204 3.8187 0.0673 9.4317 2.2461 4.7140 1.7865 0.8505 3.5386 6.2538 14.2067 0.7344 0.0255 8.9187 2.6832 15.6545 8.4594 13.4859 0.5898 54.1343 45.2285 30.9514 15.1791 12.8081 3.5053 16.9429 10.3838 1.7570 28.5328 52.8541 19.3339 2.8242 9.5886 0.3332 0.1130 3.3552 51.7611 1.2565 394.6811 49.8672 69.8727 9.1504 13.4863 12.5734 179.3269 48.1304 20.5976 252.1272 5.6580 174.0763 1.6158 40.5440 24.9467 46.4776 4.2995 151.9245 36.1385 18.8765 26.5922 11.8867 8.3276 11.0231 6.0064 10.8607 20.8205 261.5154 351.4094 6.2401 354.2438 43.8756 83.1472 15.7905 27.0274 10.1671 7.0294 9.9983 10.2948 4.4929 63.9282 23.3034 26.2864 17.0490 4.2457 7.0971 0.9688 3.2952 14.7972
temp: 298.150 k
press: 1.00000 atm
elementType: 17 8 8 8 7 6 6 6 6 6 6 6 6 6 6 6 6 6 1 1 1 1 1 1 1 1 1 1 1 1 1 1 1 1
symmnumber: 1
zpe: 704666.9 jmol-1
zpe.correction: 0.268393 hartree
zpe.thermalcorrener: 0.287367 hartree
zpe.thermalcorrenthalpy: 0.288311 hartree
zpe.thermalcorrgfe: 0.217625 hartree
zpe.sumelectzpe: -1244.158446 hartree
zpe.sumelectthermal: -1244.139472 hartree
zpe.sumelectthermalent: -1244.138528 hartree
zpe.sumelectthermalfe: -1244.209214 hartree
dipole: -0.9646 1.1179 -0.1035
dipole: 1.4802
quadrupole: -122.1594 -112.0968 -113.9382
quadrupole: 20.3267 -2.1155 1.2922
quadrupole: -6.0947 3.9680 2.1266 20.3267 -2.1155 1.2922
hfenergy: -1244.426839 hartree
pointgroup: C01 [X(C13H16Cl1N1O3)]
dipole: -0.3925382 0.4295159 -0.0236832 debye
polarizability: 301.1711565|4.7111439|157.9905863|0.8222014|-1.0286789|92.5191184 unknown
InChI: InChI=1S/C13H16ClNO3/c1-9(2)18-13(17)10-3-5-11(6-4-10)15-12(16)7-8-14/h3-6,9,15H,7-8H2,1-2H3
charge 0 multiplicity 1
34 atoms
Cl 7.836746 -0.147061 -0.188672
O  -3.586566 -0.780617 -0.035848
O  -3.766654 1.547083 -0.154324
O  3.391227 -1.518373 0.180891
N  2.685932 0.720276 0.032606
C  -5.090466 -0.899241 -0.048658
C  -1.566303 0.504073 -0.050637
C  1.268974 0.594326 0.008732
C  -0.889863 1.750613 -0.108073
C  -0.807544 -0.690817 0.036748
C  0.511748 1.796685 -0.078957
C  0.599337 -0.658864 0.066809
C  -5.379862 -2.285473 -0.628479
C  -5.61476 -0.694478 1.37981
C  -3.055536 0.510079 -0.084151
C  5.096065 0.250378 0.197066
C  3.65381 -0.281187 0.129212
C  6.066896 -0.760689 -0.421105
H  -5.470255 -0.096813 -0.70826
H  -6.471489 -2.443986 -0.695214
H  -4.950178 -2.386646 -1.639698
H  -4.952138 -3.075214 0.01415
H  -6.714749 -0.80369 1.395489
H  -5.36408 0.314707 1.746821
H  -5.18095 -1.445459 2.063674
H  -1.484111 2.66745 -0.175203
H  -1.332123 -1.649094 0.080538
H  1.025923 2.765469 -0.123714
H  1.184377 -1.577199 0.132818
H  3.038077 1.679927 -0.015787
H  5.362219 0.400372 1.261519
H  5.195724 1.230723 -0.304986
H  5.929988 -0.873158 -1.506001
H  6.007584 -1.737802 0.07518
