program: Gaussian 09
title: 000237732
version: EM64L-G09RevD.01
frameworkgroup: C1[X(C16H24N2O3)]
method: RPBEPBE
basis: SDD
operation: Freq
keyword: #p
keyword: freq=noraman
keyword: PBEPBE/SDD
title: #p freq=noraman PBEPBE/SDD
converged: YES YES NO NO
title: Mulliken charges:
elementType: O O O N N C C C C C C C C C C C C C C C C H H H H H H H H H H H H H H H H H H H H H H H H
charge: -0.295394 -0.253778 -0.266471 -0.384555 -0.443886 -0.045285 -0.283831 -0.691277 -0.698270 -0.323744 -0.372657 -0.480888 0.242073 0.489161 0.157583 0.171940 -0.674470 -0.334692 -0.344562 -0.449199 -0.343387 0.210889 0.214970 0.231803 0.212534 0.232166 0.210185 0.211878 0.219947 0.212696 0.193729 0.215724 0.190969 0.213117 0.247174 0.251163 0.272886 0.361390 0.210962 0.212762 0.224574 0.268504 0.270245 0.229319 0.306003
chargesum: 0.00000
title: Mulliken charges with hydrogens summed into heavy atoms:
elementType: O O O N N C C C C C C C C C C C C C C C C
charge: -0.295394 -0.253778 -0.266471 -0.111670 -0.082496 0.165604 0.162941 -0.036391 -0.053749 0.085709 0.031430 0.017449 0.242073 0.489161 0.157583 0.171940 -0.026171 -0.066188 -0.074317 -0.219880 -0.037384
polarizability: 3.30538439e+02 -1.76426877e+01 1.98958519e+02 -9.85099885e+00 -5.36540728e+00 1.26903938e+02
1716.lowfreq: -3.3190 -0.0012 0.0009 0.0011 3.6001 4.7834 12.0964 20.0701 26.9041
frequency: 3.9487 19.9333 26.8404 41.9549 45.0023 53.0137 63.4562 70.5255 80.1080 96.7204 108.6198 141.1961 168.5968 188.3135 196.9084 208.9256 225.8932 233.8300 242.8356 257.3344 305.2681 323.3017 327.4566 357.9063 365.0918 388.5572 412.1479 414.7087 424.4273 507.5193 527.8388 539.1072 555.7064 578.4093 630.7380 674.8915 678.3793 722.5500 756.0105 760.7003 768.8410 813.9893 838.9268 842.2038 883.5440 887.4481 890.5431 893.8187 917.3308 924.4565 929.1296 937.5746 957.6683 958.9792 964.0055 985.0878 1006.1752 1009.8172 1028.5217 1055.1183 1064.5986 1120.3918 1125.6814 1133.8072 1134.2621 1136.3758 1167.6875 1179.6319 1180.9999 1185.4923 1220.7775 1244.5198 1250.0678 1257.2152 1270.0010 1286.4866 1292.6056 1298.8874 1306.7448 1322.0447 1345.3282 1358.0605 1372.0562 1376.5358 1377.4750 1394.3343 1396.8409 1425.7890 1444.4373 1451.3405 1457.8352 1468.5052 1471.5852 1471.6979 1480.5521 1481.5188 1482.2991 1488.4226 1490.4578 1495.6828 1519.4473 1577.4565 1614.3943 1620.1930 1633.2827 2901.4848 2970.2236 2971.4034 2978.6931 2979.8398 2983.4018 2985.9006 3007.6755 3011.6453 3036.2191 3049.1898 3063.4514 3071.9498 3075.5463 3077.6326 3082.4032 3082.7842 3084.3957 3125.2570 3162.1403 3170.1140 3190.4578 3232.1407 3442.1003
redmass: 3.7066 3.8332 3.9357 4.0623 2.6629 2.2326 3.9083 3.6493 4.6311 3.4664 3.0859 4.2290 3.6434 2.3675 1.4518 1.9084 1.3255 1.1736 4.1651 3.4415 4.2281 4.9676 4.8285 2.9193 4.0430 3.3227 1.9434 2.9256 4.2580 3.1962 4.9024 4.5537 4.1358 3.5489 7.1005 3.8729 4.2815 1.5824 1.0840 4.5124 5.1339 2.6140 4.6366 1.3660 1.5079 1.2509 1.6763 2.4548 1.2100 2.1589 1.6224 2.2398 1.9900 2.1818 1.5931 1.3632 3.3128 1.3307 1.9275 4.2888 2.6295 1.3427 2.0243 3.0424 2.2680 1.7022 1.8995 2.5666 1.2562 1.8233 1.3188 2.3888 1.2186 1.3678 2.1276 1.0921 1.3827 1.3084 1.3429 1.3833 1.4311 1.4021 1.4539 5.1199 1.2192 1.2077 1.2139 4.2577 1.1962 1.0935 1.0772 1.0559 1.0638 1.0658 1.0422 1.0557 1.0902 1.5665 1.0889 1.2381 3.2091 5.6406 8.1623 6.8713 8.0041 1.0693 1.0631 1.0356 1.0360 1.0363 1.0616 1.0837 1.0567 1.0888 1.1004 1.1000 1.1002 1.1010 1.1009 1.1003 1.1016 1.0993 1.1034 1.0895 1.0952 1.0897 1.0965 1.0767 1.0746
irintensity: 0.1061 1.0414 0.9481 0.0836 1.6804 0.1691 1.5148 2.9828 2.2620 2.0242 3.4596 0.4313 0.8485 2.4323 1.1363 3.0911 0.5586 0.8124 2.7811 4.7996 7.9699 2.5067 18.2733 0.9281 3.7838 9.5730 2.4635 0.0835 16.4255 7.1672 2.5137 2.1129 8.6063 5.5658 0.8127 2.0091 29.0153 91.8612 7.8855 8.6515 12.2576 4.6454 6.0851 7.2526 49.2975 7.3377 5.3674 1.9617 6.6124 14.4599 21.3575 21.1352 80.6671 14.7821 2.0890 1.0001 63.8275 1.1940 21.7710 426.9577 0.6814 21.3864 1.6520 84.3417 0.1865 11.2220 12.3375 25.1286 106.8916 2.3165 0.7945 382.2434 6.3401 16.4988 26.1784 3.1277 9.0008 4.3881 17.8571 7.1063 3.9490 38.1990 22.5430 45.2983 20.9981 14.9843 10.5565 27.7443 20.1269 52.7180 7.3334 17.9134 23.0366 8.1178 12.5276 12.3966 31.9649 231.4750 38.3745 53.5643 615.9511 34.5992 432.1324 21.8752 162.0374 108.1727 35.0241 39.4589 21.9968 35.5555 32.5016 13.8057 55.0037 15.5633 28.7646 10.3741 25.6093 11.9754 72.8826 58.9857 37.8496 38.4950 47.4973 13.2974 5.0341 1.3813 2.3410 477.2466 0.5410
temp: 298.150 k
press: 1.00000 atm
elementType: 8 8 8 7 7 6 6 6 6 6 6 6 6 6 6 6 6 6 6 6 6 1 1 1 1 1 1 1 1 1 1 1 1 1 1 1 1 1 1 1 1 1 1 1 1
symmnumber: 1
zpe: 991870.0 jmol-1
zpe.correction: 0.377783 hartree
zpe.thermalcorrener: 0.400906 hartree
zpe.thermalcorrenthalpy: 0.401850 hartree
zpe.thermalcorrgfe: 0.320013 hartree
zpe.sumelectzpe: -957.693033 hartree
zpe.sumelectthermal: -957.669910 hartree
zpe.sumelectthermalent: -957.668966 hartree
zpe.sumelectthermalfe: -957.750804 hartree
dipole: -4.7062 -1.0655 1.1201
dipole: 4.9536
quadrupole: -81.3794 -140.6982 -125.6883
quadrupole: 14.2879 -5.8642 0.6137
quadrupole: 34.5426 -24.7762 -9.7663 14.2879 -5.8642 0.6137
hfenergy: -958.0708166 hartree
pointgroup: C01 [X(C16H24N2O3)]
dipole: 1.8896604 0.2463252 -0.4083489 debye
polarizability: 329.4850756|2.2034672|127.010145|22.2413439|9.0998249|199.9056759 unknown
InChI: InChI=1S/C16H24N2O3/c1-4-9-17-10-15(19)18-14-7-5-13(6-8-14)16(20)21-11-12(2)3/h5-8,12,17-18H,4,9-11H2,1-3H3
charge 0 multiplicity 1
45 atoms
O  -3.865621 -0.146468 0.158733
O  2.461414 0.575557 3.209462
O  -3.251751 -0.253151 -2.098831
N  5.132945 0.697658 0.649077
N  2.512326 0.362682 0.847861
C  -6.05837 1.024683 0.166364
C  -5.305302 -0.267447 -0.202625
C  -5.54717 2.232082 -0.650366
C  -7.574875 0.796243 -0.046565
C  6.301456 -0.151079 0.291557
C  6.691585 0.036464 -1.18747
C  4.622416 0.570077 2.036122
C  -1.538448 -0.005957 -0.383236
C  1.155216 0.243942 0.480678
C  3.075647 0.512352 2.103477
C  -2.930499 -0.143949 -0.88709
C  7.898806 -0.837898 -1.588607
C  -0.479247 -0.01152 -1.329728
C  -1.232388 0.127368 0.996424
C  0.851766 0.11135 -0.905051
C  0.098155 0.252021 1.43486
H  -5.879489 1.223888 1.242618
H  -5.678371 -1.126352 0.382956
H  -5.383128 -0.482102 -1.284455
H  -5.691298 2.062237 -1.734047
H  -4.471352 2.408195 -0.473828
H  -6.092813 3.151861 -0.370349
H  -7.79675 0.58188 -1.109661
H  -8.145881 1.697672 0.240041
H  -7.950488 -0.050182 0.558863
H  7.188054 0.060687 0.93514
H  6.019722 -1.207185 0.468065
H  6.931522 1.104485 -1.371388
H  5.816262 -0.205495 -1.820511
H  4.947396 1.384301 2.713835
H  4.994549 -0.372343 2.480128
H  5.30085 1.680243 0.392287
H  3.259115 0.354142 0.121201
H  8.792565 -0.588675 -0.986552
H  7.679721 -1.91154 -1.438929
H  8.158022 -0.692686 -2.652323
H  -0.725996 -0.114725 -2.391328
H  -2.050421 0.130366 1.72185
H  1.665748 0.104687 -1.640117
H  0.3404 0.355236 2.49456
