program: Gaussian 09
title: 000237720
version: EM64L-G09RevD.01
frameworkgroup: C1[X(C13H17Cl2NO3)]
method: RPBEPBE
basis: SDD
operation: Freq
keyword: #p
keyword: freq=noraman
keyword: PBEPBE/SDD
title: #p freq=noraman PBEPBE/SDD
converged: YES YES NO NO
title: Mulliken charges:
elementType: Cl Cl O O O N C C C C C C C C C C C C C H H H H H H H H H H H H H H H H H
charge: -0.060957 -0.061487 -0.282160 -0.407711 -0.238816 -0.182843 0.490873 -0.386320 -0.385158 -0.548400 -0.390929 0.376704 -0.585546 -0.585856 -0.231861 -0.395401 -0.268439 -0.504059 0.191242 0.252113 0.247633 0.246955 0.249896 0.254952 0.233304 0.266772 0.296736 0.267756 0.293943 0.222720 0.256134 0.225435 0.225776 0.268854 0.268769 0.379379
chargesum: 0.00000
title: Mulliken charges with hydrogens summed into heavy atoms:
elementType: Cl Cl O O O N C C C C C C C C C C C C C
charge: -0.060957 -0.061487 -0.282160 -0.028333 -0.238816 -0.182843 0.490873 0.113426 0.111693 -0.293448 -0.157625 0.376704 -0.022037 -0.024157 -0.009141 -0.139267 0.182772 0.033564 0.191242
polarizability: 2.59167301e+02 -2.56638059e+00 1.96433792e+02 -1.33818259e+00 1.78663944e+01 1.02860227e+02
1716.lowfreq: -6.0447 -0.0017 0.0014 0.0017 1.9575 4.9505 15.8206 23.2812 30.4925
frequency: 15.5525 23.2592 30.4483 31.8983 47.6645 52.4055 65.8494 96.7672 106.6981 120.3964 128.1730 152.0603 196.0862 204.2788 210.1069 229.8250 243.4130 250.6500 279.0698 350.8159 388.3572 420.6151 455.9346 477.2674 508.7426 534.3016 548.9666 586.0453 601.2213 611.9245 640.5342 665.0365 683.7480 696.2098 715.1976 758.3384 782.5612 789.2025 812.6001 840.5155 842.9850 851.4172 894.0504 955.5074 958.8617 979.2500 999.6802 1006.6354 1034.8557 1036.6262 1048.5391 1054.7981 1063.8896 1103.7577 1113.0933 1123.2378 1154.6570 1171.5493 1191.2731 1216.0389 1226.0440 1247.7632 1253.5535 1260.8916 1269.0681 1281.2148 1292.1417 1312.1013 1334.6250 1351.9281 1355.1188 1380.8361 1390.0370 1396.6617 1441.9151 1454.6882 1457.8671 1462.1377 1483.8559 1485.5409 1491.2177 1504.0212 1577.3061 1625.1624 1662.4130 2979.4279 3012.2364 3018.1483 3018.2298 3039.3627 3062.8157 3063.5110 3069.2040 3074.3175 3076.2614 3135.1268 3148.1613 3149.0517 3166.1635 3170.3046 3178.9099 3515.2350
redmass: 8.3423 11.9443 14.7589 11.2110 5.6597 5.3669 6.4739 2.6066 2.4498 2.4632 2.7791 5.8229 4.5655 5.7169 5.4225 5.5387 4.8545 5.2764 4.3725 4.6418 3.0492 4.5875 3.1361 4.9916 1.8067 4.4884 3.9111 5.0908 5.7037 4.7449 1.3430 7.0168 2.1806 3.8166 5.4497 1.4798 1.1241 1.1473 1.2939 1.5088 4.4836 1.6970 4.0967 1.4976 2.5343 4.9485 1.4801 2.6243 4.1623 3.5779 1.8679 2.3567 1.7463 1.7304 2.4568 1.3701 1.6497 1.1658 1.1736 1.8686 2.5238 1.5336 1.1625 1.1622 1.1146 1.4080 1.1925 1.4024 1.7578 1.2600 1.4428 1.8268 4.3942 1.8354 1.0915 1.8461 1.1419 1.3373 1.1064 1.1729 2.1729 1.1703 5.9813 6.6964 8.2531 1.0563 1.0601 1.0606 1.0607 1.1064 1.0582 1.0606 1.0996 1.1033 1.1012 1.0873 1.1120 1.1118 1.0916 1.0905 1.0965 1.0640
irintensity: 0.0536 1.1733 1.0629 0.2994 0.7636 0.2309 0.6705 1.7671 3.5136 3.0224 2.8872 1.2899 1.6785 4.1555 1.6708 3.9317 5.5548 7.0505 0.8077 12.3668 1.8115 9.4153 4.3084 24.2452 32.3998 14.5480 17.8845 7.0073 41.0551 1.2273 129.7909 67.0411 56.4686 59.8456 7.5340 60.1249 4.1587 16.5470 3.1466 3.9660 4.1971 37.9325 10.8046 1.4245 5.9310 5.7610 34.5524 238.4600 1.5107 4.2042 95.3453 77.0281 3.4824 9.4665 52.3691 35.2097 246.7623 0.4858 9.6380 29.3607 115.9389 8.3755 11.9099 16.3515 0.0313 10.4658 14.8557 4.5575 53.8237 2.3456 33.0986 14.4121 3.0946 135.5387 33.1230 3.4161 8.4033 15.5047 28.9727 37.7422 140.9455 51.0152 96.2220 391.6979 207.2777 27.4775 24.6387 16.7818 5.8066 20.6112 11.9389 13.8032 14.9898 9.4684 13.3536 12.1580 7.1515 16.0046 23.4071 8.9695 3.6945 27.8791
temp: 298.150 k
press: 1.00000 atm
elementType: 17 17 8 8 8 7 6 6 6 6 6 6 6 6 6 6 6 6 6 1 1 1 1 1 1 1 1 1 1 1 1 1 1 1 1 1
symmnumber: 1
zpe: 741852.3 jmol-1
zpe.correction: 0.282557 hartree
zpe.thermalcorrener: 0.302958 hartree
zpe.thermalcorrenthalpy: 0.303902 hartree
zpe.thermalcorrgfe: 0.228303 hartree
zpe.sumelectzpe: -1704.672890 hartree
zpe.sumelectthermal: -1704.652489 hartree
zpe.sumelectthermalent: -1704.651545 hartree
zpe.sumelectthermalfe: -1704.727145 hartree
dipole: -1.6227 -0.1642 0.0123
dipole: 1.6311
quadrupole: -124.4952 -141.7788 -125.8356
quadrupole: -1.8124 -3.1744 0.1884
quadrupole: 6.2080 -11.0756 4.8676 -1.8124 -3.1744 0.1884
hfenergy: -1704.9554471 hartree
pointgroup: C01 [X(C13H17Cl2N1O3)]
dipole: 0.6291669 0.1230846 -0.0282472 debye
polarizability: 259.1271475|2.7924823|190.7533954|-1.7024563|-28.6740888|108.580777 unknown
InChI: InChI=1S/C13H17Cl2NO3/c14-5-7-16(8-6-15)11-2-1-3-12(10-11)19-9-4-13(17)18/h1-3,10,17H,4-9H2
charge 0 multiplicity 1
36 atoms
Cl -2.06312 -4.589123 0.575746
Cl -6.345612 1.402981 0.473364
O  2.132225 0.045139 0.112575
O  6.901408 -0.242551 0.407524
O  6.040591 1.741993 -0.439094
N  -2.672694 -0.504717 0.144989
C  -1.546722 0.302003 -0.14649
C  -2.527167 -1.826635 0.775846
C  -4.037933 -0.058637 -0.176352
C  -0.227846 -0.16891 0.100909
C  -1.700448 1.61478 -0.697205
C  0.892344 0.642328 -0.185135
C  -2.25403 -2.913412 -0.282018
C  -4.603403 0.834797 0.944682
C  -0.567992 2.39915 -0.98005
C  0.744942 1.939375 -0.732221
C  3.346079 0.82599 -0.164981
C  4.510041 -0.076877 0.24832
C  5.847041 0.595439 0.023715
H  -1.716311 -1.818218 1.525273
H  -3.456303 -2.076547 1.318442
H  -4.690199 -0.941709 -0.296629
H  -4.061369 0.483421 -1.138039
H  -0.026769 -1.162297 0.509621
H  -2.690663 2.030946 -0.900243
H  -3.092212 -3.031049 -0.985008
H  -1.31443 -2.743406 -0.826432
H  -4.711453 0.292832 1.895977
H  -4.014415 1.751756 1.087911
H  -0.710797 3.401012 -1.400412
H  1.603633 2.575142 -0.960134
H  3.404308 1.083554 -1.240431
H  3.344298 1.766015 0.420397
H  4.422093 -0.356709 1.314139
H  4.483983 -1.02519 -0.319176
H  7.767103 0.223632 0.249322
