program: Gaussian 09
title: 000237722
version: EM64L-G09RevD.01
frameworkgroup: C1[X(C15H23NO5)]
method: RPBEPBE
basis: SDD
operation: Freq
keyword: #p
keyword: freq=noraman
keyword: PBEPBE/SDD
title: #p freq=noraman PBEPBE/SDD
converged: YES YES NO NO
title: Mulliken charges:
elementType: O O O O O N C C C C C C C C C C C C C C C H H H H H H H H H H H H H H H H H H H H H H H
charge: -0.285882 -0.445441 -0.460662 -0.260691 -0.252793 -0.181165 -0.425875 -0.442804 0.465092 -0.552650 -0.314651 -0.306112 -0.381449 0.378669 -0.234666 -0.400929 -0.271860 -0.529454 0.255531 -0.265736 -0.662479 0.208996 0.275872 0.214076 0.261721 0.247773 0.206362 0.215834 0.228225 0.196162 0.229001 0.217674 0.254002 0.223996 0.221935 0.260735 0.260157 0.348617 0.349476 0.224933 0.234209 0.228151 0.249272 0.218830
chargesum: 0.00000
title: Mulliken charges with hydrogens summed into heavy atoms:
elementType: O O O O O N C C C C C C C C C C C C C C C
charge: -0.285882 -0.096824 -0.111186 -0.260691 -0.252793 -0.181165 0.058993 0.032993 0.465092 -0.304876 0.107544 0.118275 -0.152448 0.378669 -0.016992 -0.146926 0.174070 -0.008562 0.255531 0.193405 0.033773
polarizability: 2.75009947e+02 -1.95067700e+00 1.77537520e+02 -1.71709412e+00 1.87531869e+01 1.32868572e+02
1716.lowfreq: -17.4677 -8.4597 -0.9349 -0.0009 -0.0004 -0.0002 5.5964 15.2780 33.3531
frequency: -15.2744 13.5123 33.2965 39.9205 53.8586 61.3996 67.1592 83.8733 85.4378 95.0634 107.7565 122.5582 127.4010 149.5536 177.9330 189.9327 218.3011 225.5496 240.6053 251.7989 271.0946 304.1733 328.8695 376.1589 380.0248 393.0915 426.9801 451.7862 457.5676 462.8606 498.4240 536.5108 557.6396 568.4196 591.6320 617.5933 659.2503 682.7850 695.1654 752.0130 779.8312 808.3249 810.3013 817.9842 832.1621 841.5256 848.2698 855.2288 893.0145 905.3815 930.9859 948.8108 969.8203 980.1465 1008.6949 1013.0898 1023.2612 1030.8916 1056.0348 1060.3456 1090.3849 1095.3556 1098.5597 1106.7719 1139.6987 1157.1899 1160.4200 1166.2413 1168.2540 1180.1517 1195.4435 1215.2803 1223.6598 1253.0423 1266.3549 1278.1597 1285.1093 1304.5435 1310.0455 1326.4887 1345.7245 1356.1074 1359.6727 1371.1133 1376.3247 1386.7145 1390.5220 1392.7773 1396.7109 1443.7336 1452.6380 1457.7766 1462.9275 1465.3978 1469.1092 1475.1242 1484.0293 1484.3733 1487.8352 1505.5762 1573.9549 1626.3207 1635.5316 2944.9808 2972.0784 2978.7094 2988.3547 2993.5178 3002.2437 3016.2185 3019.0645 3030.4234 3038.2114 3066.6814 3072.5848 3074.9471 3088.4427 3093.7919 3094.2471 3120.4675 3130.5036 3171.8019 3173.3040 3180.8432 3538.7633 3579.7946
redmass: 4.0771 5.0222 4.7245 4.8307 5.0305 4.7566 4.2399 3.9980 4.4845 3.1262 2.2778 2.7786 3.4066 3.3734 4.3276 2.7304 1.5630 3.1885 3.5143 1.3638 3.1372 3.1544 3.7596 3.0802 1.7633 2.2403 2.4199 2.7958 3.1965 2.5752 3.8519 2.0465 2.9062 3.2877 5.1135 4.2132 4.6301 1.8030 4.6586 1.4854 2.4101 1.6979 1.4495 2.3068 1.5046 1.6465 2.4628 3.0886 2.1431 3.2689 2.6253 1.3045 3.3039 3.8293 3.4745 3.2240 2.9774 2.8360 1.8040 1.7225 1.8793 2.1851 2.9582 1.8449 2.6010 1.6659 1.6810 1.6461 1.1741 1.4758 1.1721 1.1202 1.8743 1.4888 1.1195 1.1163 1.3742 1.5761 1.3763 1.1899 1.4100 1.2844 1.3582 1.3139 1.5781 1.9450 1.3403 2.7578 1.4106 1.0984 2.1347 1.0906 1.0461 1.0949 1.2696 1.1018 1.1320 1.2797 1.2991 1.4996 5.8696 6.7012 8.8325 1.0594 1.0658 1.0563 1.0689 1.0360 1.0659 1.0607 1.0999 1.0597 1.1060 1.1004 1.0970 1.1014 1.0974 1.0953 1.1030 1.1061 1.0878 1.0907 1.0903 1.0957 1.0653 1.0667
irintensity: 0.6000 0.2128 1.1912 0.1936 1.5708 1.2842 0.8910 6.4078 0.5137 6.1500 1.6015 15.3321 4.5566 4.5309 2.0457 0.2695 11.8512 10.6462 19.3683 123.0932 3.6915 35.0658 11.8646 2.4809 86.9986 37.7831 28.7204 27.8723 6.6290 11.1799 5.8298 6.8196 1.4816 5.7444 12.9124 3.6930 6.7895 29.6581 5.9165 58.1239 6.0181 5.4712 3.8776 0.7777 14.9239 29.2859 29.3232 2.6151 18.0749 21.5672 13.0887 0.2608 17.4857 44.5717 106.5020 266.5867 30.6189 9.7672 12.8278 4.2613 2.2508 47.0240 58.3280 4.9449 421.9591 57.5022 107.6059 59.3118 0.7597 34.0340 7.0171 28.7311 30.2393 6.4083 0.1074 2.3739 24.6101 107.4424 3.7556 26.4851 29.1727 1.1662 19.8406 56.1474 10.8304 35.5924 26.5780 69.7023 6.4593 32.1435 2.8705 11.5040 13.8937 13.8357 23.4261 7.6032 54.4308 34.9145 19.2038 97.2277 107.6277 361.1633 155.9324 57.4571 41.4329 27.1875 50.2633 19.2771 14.4583 9.1017 71.6749 30.4742 20.3374 19.2897 34.0600 15.9030 36.7897 23.0584 0.7961 33.1592 15.1759 20.5910 11.5596 4.2060 1.3338 4.2845
temp: 298.150 k
press: 1.00000 atm
elementType: 8 8 8 8 8 7 6 6 6 6 6 6 6 6 6 6 6 6 6 6 6 1 1 1 1 1 1 1 1 1 1 1 1 1 1 1 1 1 1 1 1 1 1 1
symmnumber: 1
zpe: 954393.8 jmol-1
zpe.correction: 0.363509 hartree
zpe.thermalcorrener: 0.386043 hartree
zpe.thermalcorrenthalpy: 0.386987 hartree
zpe.thermalcorrgfe: 0.309043 hartree
zpe.sumelectzpe: -1014.591401 hartree
zpe.sumelectthermal: -1014.568868 hartree
zpe.sumelectthermalent: -1014.567923 hartree
zpe.sumelectthermalfe: -1014.645867 hartree
dipole: 3.0890 2.5834 -1.4349
dipole: 4.2749
quadrupole: -121.4171 -118.6507 -126.7015
quadrupole: 2.1275 17.0258 -0.5857
quadrupole: 0.8393 3.6057 -4.4450 2.1275 17.0258 -0.5857
hfenergy: -1014.9549108 hartree
pointgroup: C01 [X(C15H23N1O5)]
dipole: -1.0778575 1.1177132 0.6462509 debye
polarizability: 273.9283644|-10.2501257|181.3288236|-3.7135876|-14.5780894|130.1588513 unknown
InChI: InChI=1S/C15H23NO5/c1-2-20-15(19)6-11-21-14-5-3-4-13(12-14)16(7-9-17)8-10-18/h3-5,12,17-18H,2,6-11H2,1H3
charge 0 multiplicity 1
44 atoms
O  -0.983617 0.557834 -0.067889
O  5.652118 -1.232084 -2.205743
O  5.151917 2.133258 1.366614
O  -5.528161 2.03249 -0.13661
O  -5.168252 -0.175201 0.535815
N  3.814703 -0.079625 -0.201555
C  5.038292 -0.826343 0.172114
C  3.986568 1.332989 -0.586937
C  2.533903 -0.590871 0.095433
C  1.359155 0.191921 -0.103967
C  5.443936 -1.866002 -0.896051
C  3.917268 2.327591 0.584974
C  2.365578 -1.923084 0.598893
C  0.080132 -0.335162 0.178684
C  1.081225 -2.421014 0.878195
C  -0.086359 -1.649653 0.67599
C  -2.344443 0.087697 0.22781
C  -3.264385 1.259072 -0.122671
C  -4.723059 0.926173 0.133481
C  -7.003703 1.849782 0.047208
C  -7.63778 1.255143 -1.213055
H  4.915948 -1.317244 1.158232
H  5.850289 -0.090892 0.286815
H  3.231367 1.614782 -1.344748
H  4.975795 1.444518 -1.065065
H  1.397066 1.219145 -0.473628
H  4.689254 -2.675282 -0.975934
H  6.41765 -2.313279 -0.632966
H  3.016759 2.13296 1.200953
H  3.867667 3.363494 0.184337
H  3.228701 -2.570092 0.769246
H  0.982936 -3.443273 1.261528
H  -1.07056 -2.067207 0.900743
H  -2.58755 -0.804683 -0.380953
H  -2.436258 -0.184156 1.297525
H  -3.138972 1.537916 -1.185229
H  -2.987298 2.154506 0.462706
H  4.791786 -0.811464 -2.465982
H  5.08755 2.621632 2.224206
H  -7.364748 2.870116 0.251986
H  -7.169539 1.201117 0.925317
H  -7.414875 1.876668 -2.097409
H  -7.269336 0.23111 -1.39118
H  -8.735962 1.209401 -1.091233
