program: Gaussian 09
title: 000237727
version: EM64L-G09RevD.01
frameworkgroup: C1[X(C16H24N2O2)]
method: RPBEPBE
basis: SDD
operation: Freq
keyword: #p
keyword: freq=noraman
keyword: PBEPBE/SDD
title: #p freq=noraman PBEPBE/SDD
converged: YES YES NO NO
title: Mulliken charges:
elementType: O O N N C C C C C C C C C C C C C C C C H H H H H H H H H H H H H H H H H H H H H H H H
charge: -0.267496 -0.244156 -0.150148 -0.466440 -0.364068 -0.364669 -0.068028 0.008025 -0.451534 -0.706208 -0.721365 0.139157 0.146271 0.361840 0.369720 -0.426675 -0.417951 -0.833187 -0.828355 -0.233290 0.217664 0.216413 0.192963 0.215541 0.218288 0.198334 0.240039 0.231992 0.222545 0.212605 0.240083 0.239301 0.223844 0.202492 0.341325 0.231804 0.232078 0.232423 0.232923 0.231565 0.287253 0.213687 0.218699 0.224694
chargesum: 0.00000
title: Mulliken charges with hydrogens summed into heavy atoms:
elementType: O O N N C C C C C C C C C C C C C C C C
charge: -0.267496 -0.244156 -0.150148 -0.125115 0.070009 0.043836 0.150260 0.206359 0.020496 -0.030974 -0.055728 0.139157 0.146271 0.361840 0.369720 -0.194870 -0.185873 -0.136276 -0.108716 -0.008596
polarizability: 2.38915549e+02 9.45593176e+00 1.99001554e+02 -1.00666441e+01 4.02808293e+00 1.40737066e+02
1716.lowfreq: -21.7468 -12.3927 -7.1975 -0.0005 -0.0004 -0.0001 16.1817 23.0874 58.9016
frequency: 11.7067 22.7420 58.8986 71.8679 82.0365 99.9201 126.3395 142.3231 149.2649 160.8719 165.0973 187.5893 195.8381 206.3951 226.4754 244.2655 270.4929 305.8347 308.8192 321.2641 328.0842 349.0302 379.8247 394.5666 460.5147 469.1472 476.7707 492.2774 514.3812 517.4296 529.4546 552.8907 587.8511 606.4590 676.3915 711.3561 747.2168 755.1003 759.6019 777.4445 809.6224 843.0895 862.8981 897.2744 902.0613 905.5133 919.1062 936.2589 942.2586 953.7104 974.7026 977.3237 986.8574 1025.3393 1039.8442 1047.6612 1051.6937 1060.8143 1089.5912 1096.5197 1118.2969 1130.4372 1140.9406 1146.0002 1159.0722 1176.7655 1187.5109 1219.1334 1224.3412 1250.3918 1260.0249 1276.5647 1278.5281 1296.8653 1313.6130 1330.0860 1334.6898 1340.4363 1353.0280 1368.6900 1375.2046 1384.0451 1389.1211 1396.2460 1398.9561 1435.0024 1444.5415 1448.9017 1455.0145 1456.4035 1457.7756 1461.9739 1465.5237 1468.4782 1474.3492 1477.4382 1479.5381 1489.7933 1493.5394 1600.7875 1603.8410 1631.6275 2885.6314 2893.8543 2949.4982 2960.4485 2970.8446 2975.5944 2989.4421 2991.3676 3027.2303 3030.6211 3032.3562 3034.7235 3047.7362 3056.6791 3084.0509 3085.4084 3085.9147 3089.1814 3097.1015 3100.5704 3120.2581 3130.2188 3155.7949 3365.7907
redmass: 3.8492 3.4412 4.6353 4.0264 3.8168 5.3313 3.2938 2.5364 2.0345 1.1121 1.7375 1.7069 1.0377 1.2716 2.6042 2.5055 3.4189 3.1233 3.3155 3.3977 3.9377 3.0114 2.2794 2.6866 3.3429 3.2155 3.3623 3.2333 4.0366 3.0720 4.2840 4.6168 3.9748 4.0724 2.8921 3.9235 4.6916 1.1411 3.3558 1.2312 3.3482 3.2468 2.8750 1.3132 2.7702 1.5949 2.4780 2.0719 2.3419 2.1440 1.3535 2.1932 1.6428 2.0547 1.7751 1.5873 1.5844 2.2447 1.9603 1.6988 2.2797 2.2408 2.1924 2.2770 2.2679 1.1720 3.4652 1.3220 2.2406 1.3535 1.6375 2.1172 1.4627 1.3828 1.4427 1.3411 1.3004 1.3164 1.3196 7.0479 1.3507 1.4068 1.2413 1.2405 1.2600 1.9985 1.1309 1.3552 1.2662 1.1161 1.0674 1.1078 1.1758 1.1071 1.4382 1.1673 1.0664 1.2922 1.2814 6.9627 5.8180 7.9410 1.0686 1.0684 1.0643 1.0827 1.0378 1.0365 1.0360 1.0360 1.0940 1.0924 1.0897 1.0897 1.0961 1.0970 1.0985 1.0985 1.0995 1.0995 1.1001 1.0997 1.0856 1.0919 1.0995 1.0758
irintensity: 0.6834 0.0693 0.6978 3.1825 1.5932 2.9079 3.4105 1.8110 2.7764 0.1447 4.5199 4.2219 0.0362 0.1673 0.4676 3.6981 1.8540 4.4860 3.8151 2.2709 1.6236 0.7708 1.2446 4.3230 0.8427 6.6761 16.6532 14.3450 1.4382 0.6431 0.9806 1.2180 7.9273 4.8508 0.9895 5.5568 1.1138 58.9961 11.0325 52.7264 23.0729 10.7295 10.7877 0.0741 4.2877 3.3197 1.1286 2.9031 6.8850 4.7655 0.3130 40.1835 4.6918 42.0575 6.1830 4.7395 8.6060 31.5026 41.1779 13.7859 21.4095 7.6336 14.1001 23.0056 15.2807 0.5252 8.9604 10.2133 10.0360 12.4787 2.2269 5.5735 2.8247 5.9392 11.6339 13.6447 0.8446 1.5926 5.0583 11.5039 27.6224 1.1596 29.8670 26.7297 4.3478 62.0803 15.0212 32.6753 5.6931 30.1101 3.5069 9.1834 4.9960 41.2051 173.9309 43.1082 14.9419 79.9972 80.1538 11.6722 10.9875 190.6167 56.1415 88.6424 40.5293 47.2091 38.2735 24.1435 21.1557 24.5717 6.7098 17.0211 60.3748 6.6173 20.4020 12.8992 43.4891 10.8367 26.3941 32.4711 47.5489 23.9113 0.2986 26.5912 36.7951 194.8775
temp: 298.150 k
press: 1.00000 atm
elementType: 8 8 7 7 6 6 6 6 6 6 6 6 6 6 6 6 6 6 6 6 1 1 1 1 1 1 1 1 1 1 1 1 1 1 1 1 1 1 1 1 1 1 1 1
symmnumber: 1
zpe: 981654.5 jmol-1
zpe.correction: 0.373892 hartree
zpe.thermalcorrener: 0.394665 hartree
zpe.thermalcorrenthalpy: 0.395609 hartree
zpe.thermalcorrgfe: 0.323515 hartree
zpe.sumelectzpe: -882.523062 hartree
zpe.sumelectthermal: -882.502289 hartree
zpe.sumelectthermalent: -882.501345 hartree
zpe.sumelectthermalfe: -882.573439 hartree
dipole: -2.0965 1.3426 -2.2218
dipole: 3.3368
quadrupole: -125.8268 -116.7855 -124.7672
quadrupole: 9.3081 -5.3587 8.9794
quadrupole: -3.3670 5.6743 -2.3073 9.3081 -5.3587 8.9794
hfenergy: -882.896954 hartree
pointgroup: C01 [X(C16H24N2O2)]
dipole: 0.6896484 1.0706486 -0.3186588 debye
polarizability: 240.6213641|0.4218049|140.655289|7.3258119|-8.8036572|197.3775158 unknown
InChI: InChI=1S/C16H24N2O2/c1-11-6-5-7-12(2)16(11)17-15(19)10-18-8-13(3)20-14(4)9-18/h5-7,13-14,17H,8-10H2,1-4H3
charge 0 multiplicity 1
44 atoms
O  4.292158 0.623613 -0.752375
O  -0.911672 -2.448047 1.705176
N  1.977131 -0.371452 0.683009
N  -0.766133 -0.428009 0.495312
C  2.517732 -1.087893 -0.509616
C  3.074933 0.356054 1.384829
C  3.232249 -0.11776 -1.478206
C  3.775112 1.344968 0.433926
C  1.245039 -1.292789 1.588843
C  2.286487 0.831378 -2.237264
C  4.985914 2.024938 1.073942
C  -0.252543 -1.465963 1.253199
C  -2.143456 -0.246894 0.122738
C  -2.466391 -0.130165 -1.26209
C  -3.152425 -0.154834 1.127387
C  -3.816509 0.073348 -1.632043
C  -4.493958 0.036913 0.711785
C  -1.389255 -0.235387 -2.325949
C  -2.822686 -0.235177 2.603485
C  -4.830258 0.150416 -0.652967
H  1.683892 -1.594068 -1.031148
H  3.248346 -1.870548 -0.191969
H  3.840344 -0.354667 1.783207
H  2.641309 0.911283 2.237542
H  3.804356 -0.718554 -2.208662
H  3.035221 2.105881 0.105343
H  1.284933 -0.887207 2.618448
H  1.692209 -2.30968 1.629314
H  1.662276 0.259627 -2.948109
H  1.615201 1.376971 -1.551622
H  2.878723 1.564788 -2.811207
H  5.466942 2.700614 0.34677
H  5.730462 1.271527 1.386545
H  4.684929 2.616811 1.957435
H  -0.033487 0.214329 0.152001
H  -4.071393 0.157864 -2.694988
H  -5.277303 0.107055 1.475524
H  -1.838084 -0.330081 -3.329103
H  -0.733762 0.657078 -2.341364
H  -0.739601 -1.113539 -2.153132
H  -2.588627 -1.276564 2.891323
H  -1.931835 0.37221 2.85136
H  -3.668075 0.122779 3.215339
H  -5.873544 0.300932 -0.951765
