program: Gaussian 09
title: 000237703
version: EM64L-G09RevD.01
frameworkgroup: C1[X(C6H11ClO3)]
method: RPBEPBE
basis: SDD
operation: Freq
keyword: #p
keyword: freq=noraman
keyword: PBEPBE/SDD
title: #p freq=noraman PBEPBE/SDD
converged: YES YES NO NO
title: Mulliken charges:
elementType: Cl O O O C C C C C C H H H H H H H H H H H
charge: -0.053242 -0.269452 -0.432214 -0.248859 0.069637 -0.608447 -0.684710 -0.544375 0.325473 -0.317254 0.265675 0.270826 0.257602 0.268744 0.218840 0.214941 0.235560 0.241916 0.243940 0.206695 0.338705
chargesum: 0.00000
title: Mulliken charges with hydrogens summed into heavy atoms:
elementType: Cl O O O C C C C C C
charge: -0.053242 -0.269452 -0.093509 -0.248859 0.335311 -0.080019 0.017815 -0.066899 0.325473 0.133380
polarizability: 9.19112835e+01 -1.35963493e+00 8.55739628e+01 2.95646728e+00 -1.38525047e+00 7.11706480e+01
1716.lowfreq: -12.5036 -5.5336 -0.0028 -0.0025 -0.0020 10.2223 20.6598 34.0288 50.7600
frequency: 20.0476 33.9210 50.7438 94.8759 121.6859 162.7168 188.2480 217.1567 221.8631 305.1015 321.8442 387.5439 412.4757 424.7029 462.1313 587.1818 690.4935 699.6347 768.1594 848.3636 858.5030 895.1126 927.7291 971.7100 1011.9507 1026.5886 1038.4766 1088.2505 1098.3631 1139.8128 1181.5521 1199.7744 1228.7908 1266.1880 1318.8813 1323.7532 1328.7879 1345.9582 1378.9323 1390.2312 1433.7551 1446.1005 1464.5141 1472.8252 1476.0198 1647.5059 2973.1233 2995.4582 3019.1343 3046.1169 3061.2524 3081.3005 3093.1894 3101.8038 3109.7348 3144.7588 3561.7340
redmass: 4.9662 6.1281 8.2697 5.0628 2.6896 4.1867 1.7113 1.5533 2.5867 3.7744 1.2225 3.1728 2.9759 3.7994 2.9492 4.3368 4.7359 3.2573 3.3246 3.5711 2.6480 1.6240 1.8286 2.8235 1.9092 1.8815 2.8344 2.0381 1.5473 1.5682 1.7346 1.4548 1.3456 1.2085 1.3018 1.3483 1.3202 1.4116 1.2640 1.2052 1.1086 1.1029 1.0579 1.0787 1.0452 10.0692 1.0682 1.0358 1.0595 1.0857 1.0576 1.1014 1.0997 1.0986 1.1001 1.1102 1.0661
irintensity: 1.2449 3.8709 3.1876 0.3966 4.2445 5.1152 5.5250 4.1499 1.7591 14.5750 172.9886 5.3252 6.2585 30.8256 20.5125 7.4883 24.7882 8.7812 4.2322 20.9274 14.2110 1.0213 15.0185 26.6591 52.8962 65.2446 14.4065 12.4937 203.3226 39.3310 137.1001 1.3728 34.6731 9.4145 24.8474 4.2953 13.1090 28.6738 31.9401 20.8752 8.8390 17.7358 9.2338 8.9547 13.8386 173.3583 79.0904 15.0371 15.7774 5.1316 16.0924 2.5136 24.6442 23.2905 11.6823 11.6018 5.0796
temp: 298.150 k
press: 1.00000 atm
elementType: 17 8 8 8 6 6 6 6 6 6 1 1 1 1 1 1 1 1 1 1 1
symmnumber: 1
zpe: 437633.2 jmol-1
zpe.correction: 0.166686 hartree
zpe.thermalcorrener: 0.178868 hartree
zpe.thermalcorrenthalpy: 0.179812 hartree
zpe.thermalcorrgfe: 0.125864 hartree
zpe.sumelectzpe: -920.150665 hartree
zpe.sumelectthermal: -920.138483 hartree
zpe.sumelectthermalent: -920.137539 hartree
zpe.sumelectthermalfe: -920.191487 hartree
dipole: 0.2662 0.5918 -2.5161
dipole: 2.5984
quadrupole: -69.9944 -63.8589 -68.2280
quadrupole: -14.6131 -3.7909 0.4297
quadrupole: -2.6340 3.5015 -0.8676 -14.6131 -3.7909 0.4297
hfenergy: -920.3173509 hartree
pointgroup: C01 [X(C6H11Cl1O3)]
dipole: 0.1074592 -0.3115016 0.9677335 debye
dipolederiv: -0.3140603 0.1578283 0.045017 0.2306454 -0.471791 -0.0462749 0.0220398 0.0037544 -0.1826681 -1.2872174 -0.4582627 0.3117776 -0.5285591 -0.580884 0.0875098 0.3272464 0.0908066 -0.589744 -0.6446857 -0.0310762 -0.1557442 0.0587681 -0.6281823 0.2695128 -0.1862637 0.2800863 -0.3110149 -0.5984626 -0.1391963 -0.0420561 -0.1486531 -0.3755421 -0.1098885 0.227617 0.0988803 -0.9294397 0.7030241 0.1790012 -0.0575825 0.3340018 0.365066 -0.0105218 0.155591 0.116692 0.1567442 0.2776084 -0.2670682 -0.0003747 -0.3084926 0.5804869 0.011263 0.0111212 -0.0023453 0.1771053 -0.1646811 0.1310344 0.0888156 -0.0248751 -0.0805676 -0.0171139 0.0391226 -0.0821178 0.0628449 -0.424114 -0.0226075 -0.1798851 -0.0109987 -0.0792681 0.0136441 -0.0730544 -0.0177403 0.0027007 1.3689862 0.5599465 -0.1519585 0.6522296 0.4451373 0.066852 -0.5336334 -0.2373339 1.248187 0.5519952 0.0173586 0.0938674 -0.0944714 0.5535435 -0.2195831 0.0215169 -0.2084472 0.3354074 0.030942 -0.0117022 0.0100219 -0.0237534 0.011632 0.061475 -0.0961009 0.0073489 -0.0173207 0.0705167 0.0704914 -0.0688524 0.0752374 -0.0080319 0.0351728 -0.0024671 0.0309968 -0.0581538 -0.0431756 -0.0392165 -0.0188448 -0.0488625 -0.0837402 -0.0236939 -0.039759 -0.0385552 0.0846776 -0.0283501 0.0482614 0.0808391 0.0459858 0.0739871 0.005207 0.0913121 -0.005042 0.0564356 0.1187336 0.0168959 -0.0217239 0.0166936 0.0531649 0.0254988 -0.0312536 0.0961907 -0.1065025 -0.0264759 -0.1174768 -0.0901819 -0.1158095 -0.0015553 -0.0343101 -0.0882657 -0.0516578 0.0665889 0.0689925 -0.0260654 -0.0017124 -0.0498922 -0.0503844 0.0589857 -0.0070342 0.0967698 0.0508391 0.0471264 0.030319 0.0456876 0.0010748 0.0974086 -0.0177918 0.0337108 -0.0562652 -0.0902167 0.0735334 0.0121515 0.0328495 0.030157 0.0378567 -0.0238461 0.0942604 0.0066012 -0.0720231 -0.1432734 -0.1113677 -0.0885626 -0.0979249 -0.083554 -0.0092643 -0.1275684 -0.052765 0.0110413 0.3630378 0.0007513 0.1686036 0.007499 0.2252179 -0.1228327 0.1618621 -0.0758572 0.1045115 unknown
polarizability: 91.9327068|1.3338384|85.5879269|-3.1700333|-0.183232|71.1352606 unknown
InChI: InChI=1S/C6H11ClO3/c1-5(4-7)10-6(9)2-3-8/h5,8H,2-4H2,1H3
charge 0 multiplicity 1
21 atoms
Cl -3.360612 1.24853 0.513217
O  -0.341807 0.133399 0.430853
O  2.831347 -0.854592 1.005849
O  0.67229 0.389229 -1.65878
C  -1.427523 -0.683907 -0.198515
C  -2.660401 -0.493772 0.67421
C  -0.974754 -2.154202 -0.24485
C  1.748062 1.311924 0.357619
C  0.666015 0.591588 -0.423898
C  3.043209 0.462924 0.39453
H  -1.593431 -0.30065 -1.22138
H  -2.428222 -0.626489 1.741205
H  -3.469736 -1.170377 0.361401
H  -0.038012 -2.234852 -0.819915
H  -0.797565 -2.549772 0.770753
H  -1.739667 -2.777936 -0.741678
H  1.968451 2.266872 -0.154037
H  1.392711 1.530585 1.379409
H  3.382859 0.244455 -0.630191
H  3.83573 1.030405 0.92521
H  2.469355 -0.734763 1.920388
