program: Gaussian 09
title: 000237694
version: EM64L-G09RevD.01
frameworkgroup: C1[X(C14H16N2O2)]
method: RPBEPBE
basis: SDD
operation: Freq
keyword: #p
keyword: freq=noraman
keyword: PBEPBE/SDD
title: #p freq=noraman PBEPBE/SDD
converged: YES YES NO NO
title: Mulliken charges:
elementType: O O N N C C C C C C C C C C C C C C H H H H H H H H H H H H H H H H
charge: -0.234272 -0.234267 -0.158942 -0.158955 -0.062202 -0.062210 -0.444833 -0.444826 -0.704732 -0.704736 0.062682 0.062709 0.285701 0.285694 -0.348996 -0.348992 -0.357821 -0.357793 0.253662 0.253658 0.237546 0.261570 0.237546 0.261565 0.225379 0.224444 0.230368 0.224446 0.230367 0.225378 0.254849 0.254851 0.275585 0.275579
chargesum: 0.00000
title: Mulliken charges with hydrogens summed into heavy atoms:
elementType: O O N N C C C C C C C C C C C C C C
charge: -0.234272 -0.234267 -0.158942 -0.158955 0.191460 0.191448 0.054283 0.054285 -0.024541 -0.024545 0.062682 0.062709 0.285701 0.285694 -0.094147 -0.094140 -0.082236 -0.082215
polarizability: 2.52303601e+02 -1.42942850e-03 1.79419375e+02 -1.33431396e+01 -3.04270158e-03 1.05947892e+02
1716.lowfreq: -2.8788 -0.0008 0.0004 0.0007 1.4576 10.3088 27.7373 42.2721 57.2696
frequency: 27.6758 42.2383 57.2696 63.6393 76.8825 98.9251 107.9680 140.7915 171.6436 177.7722 207.4887 216.4010 249.8281 252.4217 282.1924 321.9393 325.8494 387.0429 389.3822 410.3308 445.6810 451.2168 462.9349 506.8952 597.5073 621.7685 635.7978 673.4412 710.3188 715.4268 774.5206 780.1482 798.2738 863.0057 868.9504 876.9107 885.4890 891.5039 897.7352 952.4336 954.8662 987.5093 1007.3207 1013.8581 1022.3469 1022.4184 1079.4429 1079.5684 1091.0183 1096.2959 1112.1711 1116.6920 1118.5227 1145.7683 1146.6969 1163.4834 1165.2228 1182.8441 1223.4463 1230.1951 1300.9085 1315.6933 1324.5175 1378.1070 1385.8030 1386.7542 1404.4073 1404.7797 1410.3516 1463.3567 1463.4656 1475.1757 1475.6228 1475.8317 1475.9784 1492.1824 1548.4696 1568.6778 1591.9014 1615.9717 2984.7808 2984.8405 3075.3582 3075.4428 3076.9754 3077.1102 3080.0412 3080.0563 3101.2893 3101.3518 3150.3821 3151.5278 3168.0225 3172.4047 3183.1349 3183.1417
redmass: 4.4644 4.1231 4.2243 3.2989 3.2019 6.7549 3.5784 4.1533 2.2741 4.2014 1.1511 1.3224 4.3950 7.5128 5.0333 3.6128 3.5698 2.3873 2.3599 2.8921 4.4204 5.4457 4.5116 4.4689 4.8337 5.5423 5.7558 5.9141 3.5504 6.3892 3.7913 2.5636 3.0289 1.3792 3.0125 3.4388 1.4204 1.2600 1.4098 3.8806 3.9696 1.3628 1.3708 2.6573 1.2804 1.2614 1.4493 1.4553 2.0922 1.7630 1.3831 1.4941 1.4628 1.8305 1.8117 2.0925 2.0649 1.1396 2.3388 2.8450 1.2828 2.1385 2.3241 5.8957 1.4297 1.4142 2.5172 1.8183 2.7075 1.0497 1.0489 1.1723 1.1414 1.0768 1.1013 2.5193 9.7283 11.4800 8.7873 6.2516 1.0360 1.0360 1.0953 1.0942 1.0636 1.0650 1.0851 1.0848 1.0976 1.0976 1.0882 1.0873 1.0961 1.0969 1.1174 1.1174
irintensity: 2.1284 2.5294 0.0301 0.0193 0.0496 7.9561 0.0689 1.9649 4.9061 3.3742 0.0016 2.6989 3.9540 0.0556 3.6115 20.7241 16.2306 0.8335 7.8360 0.0977 2.1477 9.9397 5.1617 8.2127 0.0320 0.2242 2.5142 3.3387 47.8802 7.7734 2.8184 4.1485 0.9661 24.1165 16.7431 4.2559 25.1170 4.8335 25.3775 44.8583 57.2157 0.1093 0.8258 3.4331 19.9575 0.0943 23.0645 0.1658 0.6031 25.8046 19.0958 30.7046 0.7859 36.4493 24.9156 1.6312 10.2799 7.7286 169.7770 16.7912 12.0326 456.6963 63.8889 0.0655 115.5942 4.6498 39.7841 130.3370 172.3237 26.4325 0.3708 4.6961 18.0249 27.1660 16.3947 11.4063 67.2759 325.6959 41.3771 0.0010 3.9881 32.9565 34.7511 0.1370 73.8644 5.1196 10.6884 1.4815 2.0351 60.9369 0.0782 3.3347 6.1495 2.0198 10.7317 10.8786
temp: 298.150 k
press: 1.00000 atm
elementType: 8 8 7 7 6 6 6 6 6 6 6 6 6 6 6 6 6 6 1 1 1 1 1 1 1 1 1 1 1 1 1 1 1 1
symmnumber: 1
zpe: 711665.3 jmol-1
zpe.correction: 0.271059 hartree
zpe.thermalcorrener: 0.288660 hartree
zpe.thermalcorrenthalpy: 0.289604 hartree
zpe.thermalcorrgfe: 0.224248 hartree
zpe.sumelectzpe: -801.655525 hartree
zpe.sumelectthermal: -801.637924 hartree
zpe.sumelectthermalent: -801.636980 hartree
zpe.sumelectthermalfe: -801.702336 hartree
dipole: -0.0009 5.8032 -0.0002
dipole: 5.8032
quadrupole: -94.1571 -106.5991 -110.2840
quadrupole: 0.0004 18.6697 0.0010
quadrupole: 9.5229 -2.9190 -6.6039 0.0004 18.6697 0.0010
hfenergy: -801.9265842 hartree
pointgroup: C01 [X(C14H16N2O2)]
dipole: 0.0002757 2.2831473 -0.0002518 debye
polarizability: 247.6998525|0.0005659|179.4193742|-28.8206486|-0.0070797|110.5516415 unknown
InChI: InChI=1S/C14H16N2O2/c1-9-7-15(9)13(17)11-3-5-12(6-4-11)14(18)16-8-10(16)2/h3-6,9-10H,7-8H2,1-2H3
charge 0 multiplicity 1
34 atoms
O  -3.286211 -1.856191 1.421266
O  3.285967 -1.856328 -1.420791
N  -3.493883 0.395096 0.812947
N  3.493646 0.395035 -0.812777
C  -4.009948 1.080602 -0.420496
C  4.009981 1.080927 0.420334
C  -4.959386 0.46638 0.619161
C  4.959194 0.46657 -0.61945
C  -3.816542 2.578489 -0.551705
C  3.816399 2.578818 0.551228
C  -2.774742 -0.814484 0.911117
C  2.774633 -0.814661 -0.910422
C  -1.349167 -0.7601 0.440823
C  1.349056 -0.760192 -0.440147
C  -0.669932 0.466088 0.217372
C  0.669848 0.466042 -0.216862
C  -0.666847 -1.986169 0.222943
C  0.666707 -1.986216 -0.22211
H  -3.897069 0.504879 -1.350645
H  3.897458 0.505421 1.350662
H  -5.496828 1.133667 1.301741
H  -5.47151 -0.473617 0.380977
H  5.496341 1.133757 -1.302361
H  5.471518 -0.473297 -0.38118
H  -2.81959 2.817041 -0.965656
H  -4.576705 3.003304 -1.232669
H  -3.912391 3.072626 0.430658
H  4.576701 3.003911 1.231862
H  3.911886 3.072728 -0.431285
H  2.819534 2.817326 0.965414
H  -1.18888 1.410204 0.409068
H  1.188823 1.41012 -0.40868
H  -1.204814 -2.920396 0.413251
H  1.204652 -2.920482 -0.412289
