program: Gaussian 09
title: 000237657
version: EM64L-G09RevD.01
frameworkgroup: C1[X(C6H11NO4)]
method: RPBEPBE
basis: SDD
operation: Freq
keyword: #p
keyword: freq=noraman
keyword: PBEPBE/SDD
title: #p freq=noraman PBEPBE/SDD
converged: YES YES NO NO
title: Mulliken charges:
elementType: O O O O N C C C C C C H H H H H H H H H H H
charge: -0.418400 -0.414787 -0.231938 -0.243266 -0.582666 0.000389 -0.263490 -0.512348 -0.741587 0.137673 0.188193 0.251033 0.312937 0.252668 0.273943 0.238565 0.220719 0.213867 0.287039 0.279440 0.375510 0.376506
chargesum: 0.00000
title: Mulliken charges with hydrogens summed into heavy atoms:
elementType: O O O O N C C C C C C
charge: -0.042890 -0.038281 -0.231938 -0.243266 -0.016186 0.251422 0.049447 0.014263 -0.068436 0.137673 0.188193
polarizability: 9.47040381e+01 7.25293996e+00 7.64289893e+01 -4.78033063e-01 -2.69257911e+00 7.80867284e+01
1716.lowfreq: -13.4363 -12.1920 -0.0008 0.0004 0.0007 3.8972 23.6610 49.1464 52.2703
frequency: 23.0994 49.1415 52.2098 114.3875 149.7699 181.3987 188.7182 226.9250 255.8854 277.0265 313.1862 334.9433 416.2243 428.8778 496.8406 532.4984 591.6202 603.8434 636.0883 641.2607 654.4721 693.4389 780.4121 846.0141 859.5309 904.6577 956.3574 1028.2983 1042.4621 1060.3258 1081.9318 1123.1545 1160.9313 1181.2965 1211.6945 1229.9275 1250.8169 1273.5290 1303.9389 1336.4147 1367.5288 1391.9018 1396.8138 1424.0473 1473.1374 1485.2025 1645.9536 1654.9506 1662.5021 2979.3806 2999.6175 3019.9519 3056.3296 3059.4898 3070.5632 3087.0118 3463.0695 3489.2794 3510.6124 3588.0974
redmass: 6.3737 8.9083 8.0438 3.8400 4.2864 3.0698 1.2105 1.4469 1.7551 3.8340 3.8666 3.3360 3.6494 3.0520 2.0284 3.1731 3.0641 2.0490 2.2220 1.3829 1.5127 3.0142 3.6533 2.8749 2.9793 1.8380 1.9542 2.7798 2.0896 1.8978 1.9321 2.9780 2.2508 1.3913 1.3953 1.4110 1.4772 1.7074 1.4495 1.3920 1.9161 1.2366 1.3506 1.0907 1.0546 1.0443 2.4234 1.6068 7.8982 1.0367 1.0622 1.0850 1.0965 1.0853 1.0986 1.0986 1.0456 1.0639 1.0639 1.0972
irintensity: 0.1640 0.5958 1.7426 0.3956 1.2926 2.8196 39.5581 0.2487 4.0329 11.3421 2.5154 5.8810 26.8554 25.3377 21.1947 24.9459 32.6376 69.4501 62.4143 91.6620 204.0853 102.4977 4.5465 9.0336 18.0707 12.1106 20.2789 125.0065 272.4297 98.7958 11.8078 29.9845 15.7694 10.5753 3.1974 12.2328 0.5482 17.7209 13.3865 14.3403 57.4595 10.3808 8.1724 32.3166 7.8891 14.1914 229.6167 39.1522 195.0363 23.2320 14.4601 4.5420 0.8274 6.4802 40.5902 24.3807 1.9466 11.6783 21.8746 7.7282
temp: 298.150 k
press: 1.00000 atm
elementType: 8 8 8 8 7 6 6 6 6 6 6 1 1 1 1 1 1 1 1 1 1 1
symmnumber: 1
zpe: 456488.9 jmol-1
zpe.correction: 0.173867 hartree
zpe.thermalcorrener: 0.186480 hartree
zpe.thermalcorrenthalpy: 0.187425 hartree
zpe.thermalcorrgfe: 0.133897 hartree
zpe.sumelectzpe: -590.019994 hartree
zpe.sumelectthermal: -590.007381 hartree
zpe.sumelectthermalent: -590.006437 hartree
zpe.sumelectthermalfe: -590.059964 hartree
dipole: 0.9053 1.0305 -0.9566
dipole: 1.6723
quadrupole: -65.6434 -61.4515 -66.3092
quadrupole: 1.7186 -3.6941 2.1819
quadrupole: -1.1753 3.0165 -1.8412 1.7186 -3.6941 2.1819
hfenergy: -590.193861 hartree
pointgroup: C01 [X(C6H11N1O4)]
dipole: -0.3191504 0.4212194 0.3919057 debye
dipolederiv: -0.6129698 0.3726429 0.100877 0.4635893 -0.8722048 -0.0596066 0.1905688 -0.0760115 -0.3497847 -1.0201943 0.2907521 0.4052415 0.3413057 -0.581355 -0.2019165 0.361857 -0.1600479 -0.4405096 -0.9831756 0.0760949 -0.0533534 -0.1201141 -0.5694203 -0.1142333 -0.2202982 -0.1015359 -0.3575713 -0.6636802 0.0982899 -0.1174542 0.1422648 -0.3641042 -0.0321921 0.1683787 -0.1419724 -0.9431233 -0.4569982 -0.0783385 0.1593393 0.0097486 -0.7040215 -0.2707468 0.159857 -0.140865 -0.3867927 0.2026185 0.0329621 -0.006512 -0.0358982 0.1399374 -0.0306883 -0.0922317 -0.1327928 0.0474047 0.1435136 -0.1412179 -0.2379277 -0.0777203 0.1273712 0.1417865 -0.2012231 0.100859 0.3009814 -0.1456057 0.1103102 -0.0759198 0.0827453 0.0419089 0.0535117 -0.192665 0.0861333 -0.193489 -0.0573292 0.0447654 -0.010726 0.0613281 0.0292446 0.0646913 0.0030922 0.0660875 0.0006886 1.3201165 -0.2911082 0.0955143 -0.1875791 1.0927402 0.2412711 0.271275 0.3397194 0.1907757 1.3278499 -0.4751125 -0.1036589 -0.5742645 0.4577915 0.1891783 -0.2299826 0.2151226 1.2416796 0.011748 -0.0612964 -0.0487427 -0.0717806 -0.0474305 -0.0501091 -0.0102916 -0.045244 0.0018204 0.1376118 0.0600187 -0.0506301 0.0588545 0.0227632 0.0193214 -0.0516564 0.0256681 0.0229968 0.0030207 -0.0421712 0.0589604 -0.0510118 0.0343052 0.0892547 0.080313 0.0702525 0.0244604 0.0748269 -0.0073449 -0.0596571 0.034791 0.0088457 -0.0816384 -0.0356715 -0.0738972 0.0740468 -0.0721997 0.1041264 0.0394778 0.0876751 0.0515565 -0.0374402 0.0666244 -0.0786523 0.0712958 0.0520193 -0.0293857 -0.0555095 -0.0653943 -0.0451091 -0.12539 -0.0629781 -0.0724991 0.0012022 0.0259655 -0.1094574 0.086174 -0.0767793 -0.017928 0.1041334 0.0585705 0.1174553 -0.0154191 0.0943124 0.0590787 -0.0301142 -0.0295957 0.360635 -0.0051976 -0.0738563 -0.0006939 0.1491225 0.1508063 0.0584083 0.0796114 0.005604 0.2341696 0.1810305 0.0423976 0.0780452 0.1090313 0.183964 -0.1191585 -0.0833011 -0.0411089 0.2391039 -0.0922725 -0.0894003 -0.1147755 0.3034512 0.2837793 0.0471415 -0.0916888 0.0433404 0.3612006 0.0172525 -0.1426793 0.0396446 0.1477324 unknown
polarizability: 94.1875929|-7.536139|76.9250087|-1.3799556|3.2455481|78.1071542 unknown
InChI: InChI=1S/C6H11NO4/c1-3(2-4(8)9)5(7)6(10)11/h3,5,8,10H,2,7H2,1H3
charge 0 multiplicity 1
22 atoms
O  0.617075 1.994437 0.160635
O  -3.265035 0.622965 0.632535
O  2.721427 1.020503 0.224323
O  -2.26028 -0.134437 -1.313356
N  1.824875 -1.021486 -1.584754
C  0.06672 -1.148281 0.189126
C  0.844825 -0.231057 -0.828094
C  -1.125401 -0.445806 0.87746
C  1.006522 -1.773498 1.242559
C  1.517176 0.949728 -0.11046
C  -2.219978 0.004076 -0.069654
H  -0.324109 -1.955641 -0.458789
H  0.089793 0.171556 -1.524478
H  -1.589858 -1.134721 1.60996
H  -0.801857 0.437695 1.457736
H  1.83125 -2.319526 0.752993
H  1.447024 -1.010339 1.911658
H  0.457589 -2.498324 1.871507
H  2.724633 -1.121912 -1.1025
H  1.946177 -0.714407 -2.553489
H  1.098115 2.7332 0.626298
H  -3.96668 0.908179 -0.014216
