program: Gaussian 09
title: 000237752
version: EM64L-G09RevD.01
frameworkgroup: C1[X(C20H16O2S2)]
method: RPBEPBE
basis: SDD
operation: Freq
keyword: #p
keyword: freq=noraman
keyword: PBEPBE/SDD
title: #p freq=noraman PBEPBE/SDD
converged: YES YES NO NO
title: Mulliken charges:
elementType: S S O O C C C C C C C C C C C C C C C C C C C C H H H H H H H H H H H H H H H H
charge: 0.239366 0.229789 -0.267501 -0.261593 0.662319 -0.959443 0.214077 -0.546017 0.161682 -0.318962 -0.332573 -0.204626 -0.182498 -0.192660 -0.217613 -0.253478 -0.252046 -0.220595 -0.220285 -0.211249 -0.211607 -0.213409 -0.228881 -0.229505 0.346902 0.260185 0.262884 0.252056 0.241110 0.233513 0.261495 0.258082 0.256569 0.259327 0.231892 0.229958 0.230646 0.231420 0.230877 0.230391
chargesum: 0.00000
title: Mulliken charges with hydrogens summed into heavy atoms:
elementType: S S O O C C C C C C C C C C C C C C C C C C C C
charge: 0.239366 0.229789 -0.267501 -0.261593 0.662319 -0.612541 0.214077 -0.285832 0.161682 -0.056077 -0.080517 0.269997 -0.182498 -0.192660 0.043882 0.004604 0.004523 0.038732 0.011607 0.018709 0.019039 0.018012 0.001996 0.000886
polarizability: 3.52487287e+02 6.51918025e+00 2.29377718e+02 7.72256231e+00 1.03809136e+01 2.03126114e+02
1716.lowfreq: -10.3737 -6.5500 -5.7373 -1.9527 -0.0024 -0.0018 -0.0015 10.7705 16.3116
frequency: -7.7443 10.5443 15.6811 22.1841 27.1321 38.8083 62.0810 76.4985 92.2844 132.6940 144.0858 169.6099 188.4684 222.7893 243.4080 262.5669 279.7712 303.8589 344.8398 394.5318 401.3932 404.0985 405.4166 406.8393 422.1495 480.3070 486.2114 534.3515 574.1901 601.2399 609.9575 610.3526 657.1905 671.5470 677.1388 680.5332 692.4977 697.1548 701.7098 723.9939 749.2356 760.4389 763.3695 783.4968 819.4564 838.1093 850.0417 852.4162 873.3391 912.3776 927.7724 929.5764 937.3842 974.9570 978.1962 980.7965 985.7260 985.9944 998.0950 998.5349 1014.3433 1014.8028 1056.0972 1069.9013 1070.5860 1071.4358 1071.5781 1072.3131 1127.2773 1134.4924 1159.6392 1168.2954 1171.2244 1171.4411 1180.7941 1182.7124 1211.2203 1255.4615 1272.8533 1298.1986 1300.5014 1362.4387 1372.1106 1372.5777 1394.7796 1423.8893 1424.1416 1439.5474 1456.5184 1457.6544 1471.7671 1485.2685 1584.5830 1585.0539 1585.9517 1586.2731 1605.8042 1624.9738 2999.2164 3072.2895 3108.4770 3126.4873 3127.0836 3136.1616 3137.9470 3149.0064 3151.1702 3151.1943 3157.6784 3162.3959 3167.4380 3168.5143 3173.5823 3182.3077
redmass: 5.2735 5.6259 4.8794 3.9669 5.3682 5.6826 6.2736 4.6357 3.1311 6.7776 7.1257 6.6877 5.2238 5.7290 6.1943 6.5321 6.8317 9.1290 7.2799 6.4793 6.3533 4.1692 2.9291 4.6791 3.4908 3.5285 3.7262 7.0391 6.2034 7.3555 6.4732 6.4717 5.7306 7.0207 7.6036 6.8008 3.9598 2.1161 2.3830 3.3995 2.9463 1.9182 2.0089 5.8064 1.4800 7.7775 1.2418 1.2431 1.4979 3.7835 1.3846 1.3882 1.3506 5.3512 1.4044 1.3929 6.2360 6.1207 1.3185 1.3189 3.4420 3.4551 3.4812 1.6303 1.7550 2.1784 1.4959 2.1823 1.0697 1.3484 1.1152 1.3917 1.0569 1.0541 1.1140 1.1141 1.6127 7.1839 1.3387 1.3236 1.3165 1.2791 9.5584 9.7485 4.0220 2.0775 2.0819 4.5043 2.0964 2.0847 2.3035 1.3008 6.2601 6.1909 6.0498 6.0403 7.7757 8.2628 1.0608 1.0876 1.1104 1.0848 1.0849 1.0885 1.0889 1.0930 1.0938 1.0897 1.0967 1.0976 1.0932 1.1014 1.0990 1.0961
irintensity: 0.2014 0.0689 0.2428 0.0762 0.3032 0.6372 0.6485 2.2576 12.5191 1.3730 0.3928 1.3798 1.4458 0.3663 1.0018 0.1228 0.1506 1.2274 0.5390 6.6309 1.5785 0.8285 0.1387 0.4741 1.6791 11.8720 21.9907 17.8902 3.8749 5.4655 0.1740 0.1154 62.4840 16.8091 2.7425 2.1488 14.2056 47.9379 42.0169 20.0180 33.7973 63.8047 53.3836 2.9610 18.3813 26.3402 0.2781 0.1107 10.2589 10.1695 3.4731 3.7998 1.0885 147.9866 0.8644 0.4926 3.6660 4.9182 0.1372 0.1236 16.2927 11.9503 19.9971 6.0571 4.9433 3.4864 7.4861 1.8951 0.0818 12.4638 14.4994 11.6388 0.1469 0.0188 2.2623 4.0410 27.4956 272.3577 4.2548 0.9273 1.0436 1.4443 0.8648 1.2509 18.5892 10.3879 9.0956 47.1873 23.6655 21.2890 134.7082 29.3223 1.7274 2.1341 7.7035 4.3184 4.9714 1.5742 140.4388 2.5954 29.2291 0.2312 0.1772 5.4488 8.5123 16.8800 21.2680 6.1541 22.2678 24.6424 2.4542 19.2298 10.1004 3.3921
temp: 298.150 k
press: 1.00000 atm
elementType: 16 16 8 8 6 6 6 6 6 6 6 6 6 6 6 6 6 6 6 6 6 6 6 6 1 1 1 1 1 1 1 1 1 1 1 1 1 1 1 1
symmnumber: 1
zpe: 788631.4 jmol-1
zpe.correction: 0.300374 hartree
zpe.thermalcorrener: 0.321042 hartree
zpe.thermalcorrenthalpy: 0.321986 hartree
zpe.thermalcorrgfe: 0.245862 hartree
zpe.sumelectzpe: -1716.582188 hartree
zpe.sumelectthermal: -1716.561520 hartree
zpe.sumelectthermalent: -1716.560576 hartree
zpe.sumelectthermalfe: -1716.636701 hartree
dipole: -0.3272 1.0830 2.6205
dipole: 2.8542
quadrupole: -129.6556 -150.3982 -150.2764
quadrupole: 3.7317 2.1411 -0.1865
quadrupole: 13.7878 -6.9548 -6.8330 3.7317 2.1411 -0.1865
hfenergy: -1716.8825622 hartree
pointgroup: C01 [X(C20H16O2S2)]
dipole: 0.3412282 0.3506084 1.0107604 debye
polarizability: 261.3857023|53.89581|290.5586527|-16.7685557|-50.5566484|233.0467635 unknown
InChI: InChI=1S/C20H16O2S2/c1-3-7-16(8-4-1)23-20(24-17-9-5-2-6-10-17)15-11-12-18-19(13-15)22-14-21-18/h1-13,20H,14H2
charge 0 multiplicity 1
40 atoms
S  -2.453279 -0.328865 -1.040745
S  0.309207 -1.725295 -0.911416
O  1.244888 4.547576 -0.101655
O  1.554559 4.739304 -2.473167
C  -0.058649 1.134592 -1.036555
C  -0.649885 -0.118879 -0.442192
C  0.797713 3.369338 -0.755765
C  0.283542 2.213408 -0.167125
C  0.980976 3.483184 -2.149728
C  0.13815 1.254046 -2.437728
C  0.662243 2.436716 -3.020354
C  1.538338 5.507229 -1.198731
C  -3.115261 -1.424377 0.296322
C  1.756802 -1.557319 0.229157
C  -2.981265 -2.829743 0.206058
C  1.750872 -2.250659 1.463277
C  -3.798234 -0.837507 1.388233
C  2.870869 -0.766867 -0.141795
C  -3.530263 -3.649691 1.21941
C  2.865591 -2.152426 2.328586
C  -4.346787 -1.663137 2.397554
C  3.97982 -0.667246 0.730449
C  -4.212066 -3.068837 2.314633
C  3.979238 -1.359565 1.964285
H  -0.676925 -0.083602 0.657887
H  0.150272 2.138529 0.915597
H  -0.113131 0.405043 -3.081474
H  0.814669 2.52737 -4.098664
H  2.533173 5.948374 -1.033647
H  0.730451 6.261954 -1.244106
H  -2.452727 -3.270142 -0.644325
H  0.882413 -2.859953 1.735131
H  -3.902488 0.251396 1.439369
H  2.865551 -0.240888 -1.101956
H  -3.427925 -4.73828 1.149649
H  2.862919 -2.692842 3.281764
H  -4.878189 -1.209332 3.241441
H  4.841393 -0.053984 0.443923
H  -4.639859 -3.707439 3.09573
H  4.841982 -1.284282 2.635776
