program: Gaussian 09
title: 000021307
version: EM64L-G09RevD.01
frameworkgroup: C1[X(C12H13NO2S)]
method: RPBEPBE
basis: SDD
operation: Freq
keyword: #p
keyword: freq=noraman
keyword: PBEPBE/SDD
title: #p freq=noraman PBEPBE/SDD
converged: YES YES NO NO
title: Mulliken charges:
elementType: S O O N C C C C C C C C C C C C H H H H H H H H H H H H H
charge: 0.156204 -0.254144 -0.275850 -0.476658 -0.645179 -0.279876 -0.469561 0.466699 0.208283 -0.774811 0.491202 -0.447952 -0.345550 -0.198573 -0.214001 -0.256426 0.256455 0.290060 0.235454 0.233464 0.232050 0.239839 0.305423 0.315935 0.220708 0.308919 0.224777 0.225382 0.227725
chargesum: 0.00000
title: Mulliken charges with hydrogens summed into heavy atoms:
elementType: S O O N C C C C C C C C C C C C
charge: 0.156204 -0.254144 -0.275850 -0.160723 -0.098663 0.189042 -0.469561 0.466699 0.208283 0.002502 0.491202 -0.227244 -0.036630 0.026204 0.011381 -0.028701
polarizability: 2.67951044e+02 -6.87749245e+00 1.66450607e+02 -3.78389252e+00 -7.16449960e+00 8.22551609e+01
1716.lowfreq: -0.0018 -0.0016 -0.0016 3.2764 4.0094 10.4405 33.2447 37.5018 53.9674
frequency: 33.2361 37.4014 53.9114 78.0418 101.6437 107.2938 127.1558 194.0827 215.3623 260.2246 281.6110 305.0354 343.2785 366.3102 380.5207 407.4567 409.1982 441.7122 511.7005 551.0540 570.6835 583.2660 614.2838 637.9499 672.1604 696.7886 723.1975 763.5664 770.4760 814.8566 838.2028 842.7352 882.0501 917.6687 955.7959 972.0953 983.2418 985.7717 999.4390 1012.6157 1026.4267 1047.1846 1054.3350 1061.6304 1090.2820 1165.5338 1171.5818 1187.8633 1197.5047 1215.5070 1232.9980 1264.8743 1295.3366 1318.6772 1361.1311 1383.7279 1389.9211 1428.1334 1434.8384 1443.8230 1459.5713 1476.2647 1484.2924 1516.5883 1580.5342 1603.5673 1608.6514 1620.9789 2986.2727 3005.5622 3041.4631 3063.8103 3090.2808 3110.0602 3120.0956 3130.8737 3140.9709 3143.5161 3164.3580 3200.6611 3465.4568
redmass: 3.7885 4.9795 5.1170 5.8832 3.4496 1.2338 2.9758 5.8990 5.3952 4.7680 2.2790 5.9717 7.7381 5.8132 3.9067 3.1753 4.2637 7.5661 2.8594 4.7897 2.9858 5.5463 6.4416 4.6967 1.2209 1.9893 7.7778 6.0442 1.7565 3.6191 4.6679 1.2951 2.2694 1.4387 4.1702 1.3522 3.7311 2.5308 1.3079 2.3397 2.0421 1.5335 1.8818 3.4117 1.5905 1.3207 1.0533 1.1149 4.0007 1.9711 1.9004 2.1286 1.1978 1.4838 1.2851 4.5104 1.3410 2.2489 1.0938 1.1435 1.0864 1.0469 2.3898 2.1484 5.8157 3.8339 5.6089 6.8940 1.0381 1.0620 1.0578 1.0971 1.1030 1.0884 1.1085 1.0868 1.0982 1.0934 1.1000 1.0947 1.0767
irintensity: 0.0847 3.7960 0.5765 1.9506 4.9179 0.0535 3.9792 1.5887 2.0765 3.9542 4.9126 5.4288 0.8884 3.2300 8.6443 0.0624 0.7218 1.5486 23.7534 3.4069 3.4923 37.1060 1.5796 2.7671 21.0918 55.4021 10.1208 39.1894 107.4653 12.3090 1.7186 0.4125 6.8492 13.7752 13.9637 0.1181 1.0255 0.8356 3.0151 33.3614 11.9179 9.2074 47.3239 79.4272 9.7388 18.9489 0.4303 2.2109 32.3244 116.5147 27.1308 69.9487 52.5436 70.5091 0.5488 98.2210 37.5775 59.7771 8.4716 54.7037 9.0414 20.1393 109.6461 410.3932 136.9020 129.8291 166.5704 30.9711 35.7852 47.8151 19.2728 13.8642 20.2940 14.3520 9.2195 0.4709 4.2799 31.6061 30.7255 7.6183 21.8933
temp: 298.150 k
press: 1.00000 atm
elementType: 16 8 8 7 6 6 6 6 6 6 6 6 6 6 6 6 1 1 1 1 1 1 1 1 1 1 1 1 1
symmnumber: 1
zpe: 593516.5 jmol-1
zpe.correction: 0.226059 hartree
zpe.thermalcorrener: 0.241194 hartree
zpe.thermalcorrenthalpy: 0.242138 hartree
zpe.thermalcorrgfe: 0.182177 hartree
zpe.sumelectzpe: -1067.160518 hartree
zpe.sumelectthermal: -1067.145383 hartree
zpe.sumelectthermalent: -1067.144439 hartree
zpe.sumelectthermalfe: -1067.204399 hartree
dipole: -2.6675 -3.5233 1.5380
dipole: 4.6792
quadrupole: -82.5951 -96.7501 -104.8492
quadrupole: 6.0688 -1.1220 -1.9126
quadrupole: 12.1364 -2.0186 -10.1177 6.0688 -1.1220 -1.9126
hfenergy: -1067.3865766 hartree
pointgroup: C01 [X(C12H13N1O2S1)]
dipole: -1.0764985 1.1959228 -0.8944251 debye
polarizability: 266.9705771|12.1551269|161.0324311|7.2925902|-22.6857439|88.6538039 unknown
InChI: InChI=1S/C12H13NO2S/c1-9-11(16-8-7-15-9)12(14)13-10-5-3-2-4-6-10/h2-6,13H,7-8H2,1H3
charge 0 multiplicity 1
29 atoms
S  -1.906461 1.618614 0.007226
O  -4.026813 -0.777887 -0.351161
O  0.134738 -1.747005 0.712333
N  0.706006 0.294645 -0.284053
C  -3.788863 1.684873 -0.097739
C  -4.303194 0.536086 -0.963364
C  -1.652993 -0.23152 0.003291
C  -2.685939 -1.136926 -0.090645
C  -0.219492 -0.642953 0.187903
C  -2.604115 -2.633646 0.051539
C  2.125903 0.268238 -0.192351
C  2.827181 1.372689 -0.752076
C  2.85512 -0.787064 0.420487
C  4.233805 1.425411 -0.699736
C  4.264392 -0.715984 0.467141
C  4.964265 0.379733 -0.08761
H  -4.034371 2.663033 -0.542974
H  -4.197349 1.623544 0.922607
H  -5.40211 0.563735 -1.046878
H  -3.852141 0.570463 -1.97346
H  -2.879161 -3.117994 -0.90371
H  -3.340745 -2.961097 0.808715
H  -1.599885 -2.946215 0.365057
H  0.318627 1.107076 -0.776487
H  2.267503 2.191346 -1.223606
H  2.314345 -1.635842 0.840898
H  4.758269 2.283398 -1.134811
H  4.819175 -1.532782 0.942717
H  6.057903 0.419629 -0.045554
