program: Gaussian 09
title: 000237637
version: EM64L-G09RevD.01
frameworkgroup: C1[X(C8H13N3OS)]
method: RPBEPBE
basis: SDD
operation: Freq
keyword: #p
keyword: freq=noraman
keyword: PBEPBE/SDD
title: #p freq=noraman PBEPBE/SDD
converged: YES YES NO NO
title: Mulliken charges:
elementType: S O N N N C C C C C C C C H H H H H H H H H H H H H
charge: 0.194923 -0.272555 -0.409426 -0.069087 -0.617690 -0.359333 -0.333577 -0.636406 -0.684025 -0.164502 -0.281150 0.176483 0.188460 0.212411 0.203045 0.193392 0.218073 0.264534 0.282322 0.219647 0.205076 0.211770 0.260807 0.324939 0.347952 0.323918
chargesum: 0.00000
title: Mulliken charges with hydrogens summed into heavy atoms:
elementType: S O N N N C C C C C C C C
charge: 0.194923 -0.272555 -0.084488 -0.069087 0.054180 0.056122 0.077888 -0.089550 -0.047531 -0.164502 -0.020343 0.176483 0.188460
polarizability: 2.03438041e+02 7.60169177e+00 1.39917646e+02 -5.50261705e+00 5.23980394e-01 7.13251255e+01
1716.lowfreq: -11.1317 -1.3923 -0.0024 0.0005 0.0009 6.1670 14.7118 31.5599 59.5211
frequency: 14.5316 31.1216 59.4643 85.9320 120.3494 138.4469 165.0372 198.6815 215.4163 235.6457 243.5470 272.6197 311.0771 323.4785 402.9292 473.7925 506.9831 514.1897 533.2596 567.4790 592.0337 625.6513 635.9948 700.6209 737.2383 741.1081 804.6880 812.2509 858.0911 871.4986 920.1388 923.9584 958.1279 1015.6845 1034.6964 1063.9097 1066.5710 1109.5556 1147.6742 1186.6749 1195.0394 1226.5240 1274.8267 1291.3742 1301.3469 1305.9472 1351.9320 1359.3988 1390.5000 1441.4417 1455.7721 1460.9690 1472.3736 1478.1250 1485.0400 1511.3883 1567.9087 1625.0031 1656.9774 2966.0230 2973.5501 2978.4984 3012.0475 3034.6147 3044.0031 3070.6090 3075.6457 3116.2874 3196.1048 3507.2220 3558.6541 3709.5433
redmass: 4.6043 3.2294 2.6936 2.5497 3.7044 5.8540 5.7759 5.6521 1.5281 1.6647 2.9940 3.4844 1.1326 4.3879 7.1483 3.3664 1.1681 5.1365 6.3661 6.5858 3.3977 3.6032 2.4426 1.9470 4.2322 1.1964 1.7116 1.6819 5.2556 1.3994 1.3433 7.8693 3.4136 2.7037 1.7421 1.3727 1.7302 2.0791 2.5507 1.4919 2.9072 1.3369 1.2254 1.1787 1.5940 1.2310 2.5221 1.7720 1.2137 1.0908 1.0788 6.1003 1.0590 1.0433 1.0761 8.0325 2.5327 1.6005 5.7346 1.0599 1.0365 1.0619 1.0953 1.0842 1.0765 1.1010 1.0991 1.1079 1.0932 1.0777 1.0454 1.1053
irintensity: 0.1607 0.1316 0.4643 0.4798 0.1166 0.0075 0.0640 13.9429 0.8845 0.7771 1.1455 2.5127 81.3314 2.4275 4.1635 7.7204 233.0455 5.0662 0.8503 1.9428 2.1532 3.2058 62.8979 30.7293 27.3366 8.4174 2.5741 51.0317 65.4133 6.2387 12.6192 25.8698 58.1972 4.4646 10.0026 2.4004 1.6584 2.3509 31.5983 4.2524 18.5509 1.7041 17.7951 11.7138 31.0158 8.2672 116.0284 30.7923 10.8717 29.0361 5.3849 22.2513 4.7712 13.2712 15.5972 113.8861 351.0410 569.8449 763.6534 12.9918 52.9533 47.2750 4.4569 4.3481 24.3386 81.2192 46.2467 16.8012 0.2250 27.4729 97.2176 43.8412
temp: 298.150 k
press: 1.00000 atm
elementType: 16 8 7 7 7 6 6 6 6 6 6 6 6 1 1 1 1 1 1 1 1 1 1 1 1 1
symmnumber: 1
zpe: 546184.0 jmol-1
zpe.correction: 0.208031 hartree
zpe.thermalcorrener: 0.222439 hartree
zpe.thermalcorrenthalpy: 0.223384 hartree
zpe.thermalcorrgfe: 0.164550 hartree
zpe.sumelectzpe: -949.216674 hartree
zpe.sumelectthermal: -949.202265 hartree
zpe.sumelectthermalent: -949.201321 hartree
zpe.sumelectthermalfe: -949.260155 hartree
dipole: 0.9164 6.8535 0.1705
dipole: 6.9166
quadrupole: -82.6968 -79.2740 -88.1224
quadrupole: -23.3040 -0.8853 1.0263
quadrupole: 0.6676 4.0904 -4.7580 -23.3040 -0.8853 1.0263
hfenergy: -949.4247043 hartree
pointgroup: C01 [X(C8H13N3O1S1)]
dipole: 0.2584495 2.5095624 1.0199443 debye
dipolederiv: -0.9026672 -0.1302318 0.0037351 -0.0012323 -0.0732513 0.0164883 0.0924435 0.032802 -0.0951836 -1.3021304 -0.5632119 -0.1801017 -0.4822054 -0.7859395 -0.1376569 -0.1387721 -0.1288179 -0.4280856 -0.5954931 -0.11815 -0.0344866 -0.1220149 -0.8935074 -0.2370371 -0.0311412 -0.236659 -0.3826059 -1.2307989 0.7523209 0.3510014 0.4062309 -1.0088942 -0.3356764 0.2347398 -0.360927 -0.3855369 -0.41074 0.3795947 0.1316998 0.4848019 -1.3030121 -0.2565642 0.1782319 -0.257715 -0.8408769 0.0124921 0.0319972 0.0062226 -0.1188348 0.0635529 0.0272575 -0.0824869 0.0018104 0.1155503 0.0188202 -0.0009125 0.0064766 0.0477854 0.0712609 0.0386514 0.0614168 0.052355 0.1360748 0.2734686 0.2092436 0.0594317 0.4048924 0.2079188 0.0421507 0.1066406 0.0442748 0.145764 -0.068096 0.0187355 0.0047015 0.0266444 0.0927496 0.0197514 -0.0327798 0.0160366 0.0795847 1.8659807 0.0172246 -0.0821617 -0.1231333 0.8769196 0.3648737 -0.1784582 0.3466953 0.1527303 -1.4107636 -0.5232355 -0.1525455 -0.1509997 -0.323591 -0.0339378 0.0097298 -0.0117106 -0.2221199 1.335837 -0.6455476 -0.3162934 -0.3765907 1.4834178 0.4990415 -0.2133377 0.5227189 0.5130688 1.8099906 0.6937876 0.1947255 0.2845721 1.1184597 0.3543446 0.0157192 0.3286432 0.3349396 0.0651506 0.0126217 0.0300931 0.0747554 0.0725712 -0.0380095 0.0505524 0.0164698 -0.1545218 -0.0814871 -0.1092788 -0.0251919 -0.0785175 -0.1276101 -0.0229442 -0.0363452 -0.0546399 0.077303 0.0228252 0.0244394 0.0701154 0.0196717 0.0601368 -0.0406913 0.045119 -0.0021953 -0.1809425 0.0345249 -0.0834391 -0.0244242 -0.1205134 -0.1097287 -0.0222304 -0.0345127 -0.0544321 0.0613065 0.0188143 -0.0367196 0.0139619 -0.1170675 0.0024138 -0.045759 0.0231663 -0.0522987 -0.1044645 -0.0250834 0.0353916 -0.0584334 -0.0121601 -0.0817715 0.0349179 -0.0898093 0.0284349 0.0366032 -0.0539888 0.0856386 -0.0648274 0.1407092 -0.0340936 0.1012502 -0.0966954 0.1006792 0.0238706 0.0134568 -0.0536995 -0.0075194 -0.1424622 -0.1348258 -0.066199 -0.0129788 -0.064889 0.0735214 0.0578926 -0.0013214 0.0245047 -0.0054484 0.0871012 -0.0331967 0.0994397 -0.0385076 -0.1664204 0.0798215 0.0334145 0.020422 0.048221 0.0390197 -0.0624455 0.0263675 -0.0611375 0.1604002 0.14405 0.0299292 0.0240972 -0.0225972 0.1663403 -0.0673169 0.0032684 -0.0700895 0.3056449 0.1555011 0.0083839 0.0180784 -0.0229368 0.2882082 -0.0393878 0.0046672 -0.0398393 0.3691058 0.1726221 -0.0669755 -0.0132817 -0.0415701 0.2461545 -0.0596746 -0.0041851 -0.0570618 0.37529 unknown
polarizability: 202.9374729|10.4240787|131.6540581|0.522374|23.2310707|80.0892814 unknown
InChI: InChI=1S/C8H13N3OS/c1-2-3-4-13-7-5-6(12)10-8(9)11-7/h5,10H,2-4,9H2,1H3
charge 0 multiplicity 1
26 atoms
S  1.21084 -0.831397 -0.516732
O  -3.872259 -2.01143 -0.683513
N  -3.185365 0.075236 0.119677
N  -0.899138 0.749372 0.252445
N  -2.579113 2.21715 0.950404
C  3.518705 0.748075 -0.198015
C  4.292621 -0.326347 0.601913
C  2.007267 0.790475 0.080979
C  5.813476 -0.266048 0.345371
C  -0.559634 -0.487407 -0.269545
C  -1.485048 -1.475946 -0.61342
C  -2.2050 0.996214 0.432335
C  -2.898695 -1.23984 -0.430888
H  3.695646 0.606391 -1.283013
H  3.927769 1.748244 0.056505
H  4.089324 -0.189006 1.683334
H  3.909499 -1.331697 0.339513
H  1.784969 0.889488 1.1559
H  1.505023 1.606532 -0.460952
H  6.350118 -1.039128 0.924788
H  6.227155 0.719542 0.632174
H  6.042153 -0.427657 -0.724976
H  -1.181905 -2.440884 -1.022559
H  -4.182207 0.267372 0.259818
H  -1.833212 2.872471 1.171333
H  -3.547287 2.477921 1.113225
