program: Gaussian 09
title: 000237676
version: EM64L-G09RevD.01
frameworkgroup: C1[X(C18H19ClO3)]
method: RPBEPBE
basis: SDD
operation: Freq
keyword: #p
keyword: freq=noraman
keyword: PBEPBE/SDD
title: #p freq=noraman PBEPBE/SDD
converged: YES YES NO NO
title: Mulliken charges:
elementType: Cl O O O C C C C C C C C C C C C C C C C C C H H H H H H H H H H H H H H H H H H H
charge: -0.051479 -0.266022 -0.235152 -0.269710 -0.515980 0.492559 0.472640 0.269411 -0.260449 -0.374886 -0.346795 -0.413987 -0.437907 -0.386586 -0.276419 -0.228060 -0.228091 -0.225603 -0.238319 -0.243418 -0.242815 -0.503410 0.244481 0.270071 0.246457 0.272731 0.251097 0.228467 0.230363 0.273804 0.216528 0.261716 0.225124 0.224498 0.225288 0.225914 0.227839 0.227832 0.212532 0.202064 0.243673
chargesum: 0.00000
title: Mulliken charges with hydrogens summed into heavy atoms:
elementType: Cl O O O C C C C C C C C C C C C C C C C C C
charge: -0.051479 -0.266022 -0.235152 -0.269710 -0.271498 0.492559 0.472640 0.269411 0.256079 -0.102155 -0.095698 -0.185520 -0.207544 -0.112782 0.201825 -0.002936 -0.003594 -0.000315 -0.012405 -0.015579 -0.014982 0.154859
polarizability: 2.10265091e+02 2.46074273e-01 2.30227750e+02 8.49964831e+00 -1.35698694e+01 1.77481789e+02
1716.lowfreq: -16.1437 -7.2149 -3.3463 -0.0016 -0.0012 0.0008 7.6019 13.0459 23.9273
frequency: -5.9562 12.7662 23.8182 28.5893 35.1714 48.8675 50.9767 63.3596 84.9165 111.3323 127.6419 150.0367 195.2357 207.1947 222.2666 239.3177 260.7112 268.7331 281.6419 297.6162 347.1423 378.2896 401.4773 402.8704 428.2372 476.7808 497.4407 536.4292 569.6436 613.9426 614.4741 628.9557 652.5211 689.7244 700.9505 706.4488 719.1997 754.0603 768.7379 816.5321 844.2756 845.5783 856.3680 857.2056 861.0705 888.4672 921.0748 929.8882 948.3584 970.3703 976.8469 982.3620 990.0899 991.0646 993.0020 999.7529 1026.3540 1029.5630 1037.8763 1074.5022 1076.9619 1084.0334 1089.4251 1108.5765 1127.2407 1152.6868 1171.2571 1172.5949 1179.9683 1188.4360 1191.9025 1193.4854 1195.6760 1237.1928 1243.7143 1264.1343 1296.8842 1325.3191 1336.4036 1338.8120 1351.8393 1367.5574 1382.0308 1384.7239 1432.6639 1439.8079 1441.2890 1441.9188 1458.3882 1461.4040 1471.0403 1479.1033 1482.1154 1592.2192 1593.8606 1607.3015 1612.2318 1650.3209 2938.9972 2991.5744 3018.5588 3021.8061 3047.1138 3061.9113 3098.0694 3105.4657 3109.7704 3116.3168 3117.6539 3126.9846 3127.2335 3139.8354 3140.1975 3151.5118 3154.2466 3164.3645 3166.2599
redmass: 5.6342 4.1278 6.1868 4.9182 5.0995 3.3549 5.4046 4.4061 3.2807 3.1013 7.3843 1.7714 4.1865 3.6105 7.1574 4.3519 5.1477 5.3026 4.4548 4.0231 5.9848 2.7749 2.7830 2.8497 2.7392 3.4741 3.6492 5.7960 4.4508 6.4107 6.2941 4.9723 3.9029 6.2484 1.7099 1.8220 4.9568 1.9451 2.4087 3.5174 3.0017 1.5226 2.5277 1.5917 4.2093 2.7840 1.7176 1.5070 2.1885 1.3970 2.6497 1.3840 5.2874 5.9861 1.3718 1.3196 2.2390 2.2435 4.2138 2.2374 1.9757 2.2304 1.6666 1.3025 2.0914 1.5530 1.1058 1.0749 2.5072 1.2923 1.5025 1.3925 1.1201 1.2251 1.5583 1.1770 1.5826 1.4558 1.2644 1.2710 1.3334 1.2950 6.7838 6.8551 1.1220 1.9181 1.8564 1.2648 1.0801 1.0576 1.0512 2.2155 2.2234 6.1164 6.0282 6.0281 5.9637 9.1043 1.0336 1.0652 1.1028 1.0572 1.0840 1.0861 1.1068 1.0993 1.0994 1.0868 1.0864 1.0869 1.0871 1.0924 1.0923 1.0954 1.0957 1.1013 1.1004
irintensity: 0.4026 0.0703 0.5194 0.4809 0.3402 1.5308 0.9271 0.6869 2.8119 2.0947 1.3046 0.9889 3.4536 4.6595 1.4590 4.1598 6.0251 9.2750 0.2585 4.2664 22.4024 7.0249 0.1114 0.1926 3.7799 5.6021 6.0621 9.3943 36.1678 1.5885 0.6073 19.3503 17.6693 3.5161 48.6678 57.1362 18.4921 34.2007 36.1910 10.5704 8.1807 2.3131 0.9959 0.2307 2.8061 5.1229 7.5674 14.6267 61.2363 0.1054 21.9767 0.0290 0.7297 7.1444 0.5953 0.2369 7.4361 7.8513 102.3465 205.2513 49.8668 217.9327 26.2076 4.9308 3.1168 16.2951 0.9856 0.4255 5.3142 0.8248 0.4438 1.7650 0.4133 12.6557 6.5826 4.0529 68.2753 4.1497 11.2204 8.9563 12.9883 7.0067 2.9374 0.2106 3.0104 26.6160 4.1405 10.8397 9.9772 14.1758 14.6242 31.4749 15.4552 4.4029 0.5056 11.8648 5.3663 117.7751 73.4353 38.3590 61.9851 18.0473 6.3020 20.7512 1.7326 19.5425 21.1461 6.2432 5.1691 0.9805 1.3555 18.4300 32.5454 18.0937 33.1935 25.1695 14.5914
temp: 298.150 k
press: 1.00000 atm
elementType: 17 8 8 8 6 6 6 6 6 6 6 6 6 6 6 6 6 6 6 6 6 6 1 1 1 1 1 1 1 1 1 1 1 1 1 1 1 1 1 1 1
symmnumber: 1
zpe: 854495.6 jmol-1
zpe.correction: 0.325460 hartree
zpe.thermalcorrener: 0.346165 hartree
zpe.thermalcorrenthalpy: 0.347109 hartree
zpe.thermalcorrgfe: 0.271590 hartree
zpe.sumelectzpe: -1381.419632 hartree
zpe.sumelectthermal: -1381.398927 hartree
zpe.sumelectthermalent: -1381.397983 hartree
zpe.sumelectthermalfe: -1381.473502 hartree
dipole: 2.4809 -0.8219 1.1250
dipole: 2.8454
quadrupole: -110.1335 -130.5496 -134.7153
quadrupole: -4.5948 -2.1300 0.9353
quadrupole: 14.9993 -5.4168 -9.5825 -4.5948 -2.1300 0.9353
hfenergy: -1381.7450923 hartree
pointgroup: C01 [X(C18H19Cl1O3)]
dipole: -0.8844637 0.4396313 0.5268945 debye
polarizability: 210.5030493|5.0745907|225.7421749|-6.6621836|19.8996243|181.729406 unknown
InChI: InChI=1S/C18H19ClO3/c1-21-12-16(19)13-22-18(20)17(14-8-4-2-5-9-14)15-10-6-3-7-11-15/h2-11,16-17H,12-13H2,1H3
charge 0 multiplicity 1
41 atoms
Cl -3.487859 -0.984186 -1.001886
O  -1.333978 1.048712 0.160878
O  -0.157088 0.633721 -1.816299
O  -4.528914 2.023063 1.616926
C  0.798741 -0.034639 0.383089
C  2.1545 0.671005 0.192349
C  0.898609 -1.565058 0.237596
C  -0.238948 0.560133 -0.572453
C  -2.470476 1.60853 -0.610422
C  -3.731509 0.78709 -0.353394
C  2.953497 0.438199 -0.954558
C  1.246183 -2.321979 1.385701
C  2.611404 1.58015 1.178066
C  0.699263 -2.239353 -0.99298
C  -4.129846 0.694951 1.131545
C  4.189431 1.10276 -1.108329
C  1.397604 -3.723356 1.308593
C  3.850567 2.24385 1.026345
C  0.84787 -3.643047 -1.069091
C  4.643871 2.006209 -0.1187
C  1.198757 -4.390526 0.077442
C  -5.934323 2.349728 1.350268
H  0.442431 0.187351 1.403453
H  -2.207908 1.635491 -1.681639
H  -2.631887 2.628633 -0.218045
H  -4.556503 1.191643 -0.964475
H  2.609331 -0.260148 -1.723839
H  1.405922 -1.809452 2.342526
H  1.99556 1.770988 2.066009
H  0.41825 -1.672173 -1.886566
H  -4.94473 -0.044286 1.265631
H  -3.257391 0.398165 1.734618
H  4.799548 0.915534 -1.999186
H  1.666755 -4.292657 2.205511
H  4.193644 2.942242 1.798025
H  0.685618 -4.152075 -2.025965
H  5.605099 2.518496 -0.239032
H  1.312121 -5.478641 0.014937
H  -6.610458 1.59061 1.794457
H  -6.153231 2.435803 0.265714
H  -6.111127 3.32462 1.83058
