program: Gaussian 09
title: 000021290
version: EM64L-G09RevD.01
frameworkgroup: C1[X(C11H19N3O)]
method: RPBEPBE
basis: SDD
operation: Freq
keyword: #p
keyword: freq=noraman
keyword: PBEPBE/SDD
title: #p freq=noraman PBEPBE/SDD
converged: YES YES NO NO
title: Mulliken charges:
elementType: O N N N C C C C C C C C C C C H H H H H H H H H H H H H H H H H H H
charge: -0.255639 -0.457482 -0.146097 -0.072319 -0.525458 -0.366104 0.107462 0.272882 -0.343989 -0.062864 0.244947 -0.809850 -0.699782 -0.671048 -0.639975 0.183649 0.242308 0.238465 0.181425 0.185334 0.208273 0.329029 0.238175 0.238144 0.265222 0.213899 0.204916 0.217754 0.232006 0.253432 0.232566 0.222237 0.316937 0.221544
chargesum: 0.00000
title: Mulliken charges with hydrogens summed into heavy atoms:
elementType: O N N N C C C C C C C C C C C
charge: -0.255639 -0.128453 -0.146097 -0.072319 -0.099501 0.053785 0.107462 0.272882 0.049619 -0.062864 0.244947 -0.068308 -0.063214 0.046956 0.120744
polarizability: 2.02704497e+02 1.03322162e+01 1.47727952e+02 1.20294879e+01 3.22040538e+00 9.84460916e+01
1716.lowfreq: -17.3258 -5.1159 -0.0001 0.0007 0.0007 6.7131 20.0379 33.7453 57.1185
frequency: 16.2682 33.6590 57.0938 64.8043 68.2773 90.3202 101.5083 107.8786 139.3280 167.9335 184.2296 186.9893 220.0460 224.9194 243.7475 306.2865 307.9753 333.0952 378.1049 425.0414 440.6188 499.5729 513.7151 525.0701 553.7478 574.7095 615.1875 690.9953 726.0609 743.0976 775.4751 779.1093 868.9546 894.7346 907.5133 960.3049 973.5261 1009.7388 1044.2952 1045.5894 1062.0864 1069.0266 1094.6250 1103.4424 1110.1666 1136.6380 1139.8328 1207.5359 1215.3700 1226.6034 1252.9742 1273.9472 1278.9063 1288.7231 1313.5957 1325.2648 1344.3905 1385.9749 1386.3625 1400.9043 1415.1711 1435.9609 1448.2604 1451.9301 1463.8236 1468.3450 1472.3372 1475.2698 1477.9815 1479.9244 1480.5297 1486.7595 1498.3695 1500.0010 1554.5891 1608.2396 1661.1563 2931.6016 2959.9583 2965.2602 2966.4187 2970.9724 2971.4317 2984.8810 2995.9716 3009.2410 3033.1542 3040.6880 3044.9210 3055.7571 3067.5241 3071.9185 3105.7911 3111.7881 3128.2404 3551.7688
redmass: 2.6845 3.8807 1.2960 2.1407 1.5118 1.6328 3.1653 2.3261 1.9591 1.4989 3.2000 2.8235 2.7694 1.1697 2.9177 3.8744 3.1124 2.5597 3.0550 4.0912 3.4272 4.2461 1.2439 5.4881 4.7044 5.4076 3.7009 11.1207 1.0934 6.0238 2.2311 2.0767 3.9025 1.7904 1.5738 2.1502 2.2242 3.9968 1.5217 1.7686 1.4720 2.5688 1.2337 2.2994 2.5316 1.3261 2.1281 3.6304 1.5562 2.5699 1.3753 3.6328 1.5008 1.0852 1.6601 1.4344 1.5582 1.2139 2.0231 1.5640 1.1707 3.6842 1.1869 1.1788 1.0694 1.1163 1.0574 1.0451 1.0925 1.0538 1.0692 1.0810 1.0471 1.1639 5.7103 4.4971 7.1153 1.0391 1.0598 1.0631 1.0354 1.0386 1.0389 1.0620 1.1015 1.0945 1.0976 1.0979 1.1026 1.1026 1.1001 1.1002 1.0935 1.0979 1.0937 1.0770
irintensity: 3.5049 1.1209 0.5604 2.2079 1.1314 1.3851 0.3570 0.5663 0.0911 1.6757 2.2290 1.7612 0.4276 0.1892 2.8387 1.0971 4.9557 5.9436 1.6451 1.2795 5.0599 8.2446 75.8188 5.7843 4.8264 0.5505 4.5688 5.0044 9.8457 5.5691 3.4012 4.0338 10.1109 3.6498 5.4324 22.1589 29.6672 9.3843 2.6229 20.3455 46.6328 0.7607 0.0550 15.1422 7.2145 0.0540 1.6569 8.3275 5.0469 84.0552 9.8148 17.8910 33.1760 12.1475 51.0219 4.4395 0.7501 11.3594 15.9456 41.1970 35.3661 127.8706 5.5220 38.5983 4.7782 40.3988 10.7131 13.0765 25.4067 23.0713 9.7501 17.4377 7.6004 61.5085 619.2341 411.5715 132.6503 66.4487 6.7749 50.4530 112.3974 41.8497 32.9372 50.3819 42.6162 9.4332 7.0348 17.9487 41.6093 10.0757 78.4780 69.2693 13.0201 0.2426 9.9387 22.3967
temp: 298.150 k
press: 1.00000 atm
elementType: 8 7 7 7 6 6 6 6 6 6 6 6 6 6 6 1 1 1 1 1 1 1 1 1 1 1 1 1 1 1 1 1 1 1
symmnumber: 1
zpe: 758204.1 jmol-1
zpe.correction: 0.288785 hartree
zpe.thermalcorrener: 0.306509 hartree
zpe.thermalcorrenthalpy: 0.307453 hartree
zpe.thermalcorrgfe: 0.241196 hartree
zpe.sumelectzpe: -668.883181 hartree
zpe.sumelectthermal: -668.865457 hartree
zpe.sumelectthermalent: -668.864513 hartree
zpe.sumelectthermalfe: -668.930770 hartree
dipole: 4.5668 7.7021 1.4771
dipole: 9.0753
quadrupole: -70.0322 -96.1600 -93.3108
quadrupole: 3.0147 3.8278 -2.9506
quadrupole: 16.4688 -9.6590 -6.8098 3.0147 3.8278 -2.9506
hfenergy: -669.171966 hartree
pointgroup: C01 [X(C11H19N3O1)]
dipole: 1.7735749 3.0878566 0.2607111 debye
polarizability: 202.439049|11.962104|148.0162466|11.3237651|-1.9761417|98.4232449 unknown
InChI: InChI=1S/C11H19N3O/c1-5-6-7-9-8(2)12-11(14(3)4)13-10(9)15/h12H,5-7H2,1-4H3
charge 0 multiplicity 1
34 atoms
O  -0.639396 -2.289774 -0.323264
N  1.457791 1.187919 -0.049607
N  3.418878 -0.051402 0.466802
N  1.39431 -1.200191 0.058813
C  -2.126189 0.076113 -0.844701
C  -3.023011 0.046777 0.424261
C  -0.649714 0.117589 -0.511764
C  0.086955 1.276658 -0.38467
C  -4.524621 -0.090696 0.087301
C  0.015936 -1.201424 -0.25736
C  2.065164 -0.055359 0.154078
C  -0.416102 2.691267 -0.5616
C  -5.418571 -0.109719 1.346127
C  4.185936 1.194981 0.571515
C  4.109422 -1.331077 0.704404
H  -2.423852 0.924518 -1.491055
H  -2.311021 -0.856157 -1.410083
H  -2.706423 -0.805288 1.055882
H  -2.857868 0.969282 1.019596
H  -4.833078 0.744484 -0.575729
H  -4.677993 -1.02312 -0.492232
H  1.989857 2.053035 0.045277
H  0.120696 3.21072 -1.379528
H  -0.275331 3.283398 0.363766
H  -1.488085 2.699982 -0.801879
H  -6.487691 -0.213198 1.08335
H  -5.301822 0.82308 1.930094
H  -5.148954 -0.954852 2.006749
H  4.185326 1.772223 -0.376966
H  5.233853 0.944403 0.796256
H  3.823153 1.850285 1.391672
H  4.924537 -1.479365 -0.029498
H  3.366247 -2.134814 0.59024
H  4.533061 -1.363981 1.726354
