program: Gaussian 09
title: 000021263
version: EM64L-G09RevD.01
frameworkgroup: C1[X(C5H8O2)]
method: RPBEPBE
basis: SDD
operation: Freq
keyword: #p
keyword: freq=noraman
keyword: PBEPBE/SDD
title: #p freq=noraman PBEPBE/SDD
converged: YES YES NO NO
title: Mulliken charges:
elementType: O O C C C C C H H H H H H H H
charge: -0.416453 -0.234794 -0.550052 -0.136081 -0.164015 0.206728 -0.728237 0.252640 0.255647 0.249981 0.214306 0.224970 0.227255 0.222625 0.375480
chargesum: 0.00000
title: Mulliken charges with hydrogens summed into heavy atoms:
elementType: O O C C C C C
charge: -0.040973 -0.234794 -0.041765 0.113900 0.050291 0.206728 -0.053386
polarizability: 8.40856964e+01 -1.06304700e+00 5.64814928e+01 -3.57212747e+00 2.33087167e+00 4.10918427e+01
1716.lowfreq: -1.2227 -0.0007 -0.0007 -0.0006 4.4769 13.7930 32.4855 63.4897 126.2580
frequency: 32.3893 63.3462 126.2543 191.0482 255.2906 301.1309 362.6071 491.3128 524.0636 587.7055 645.0448 747.0086 861.3102 908.3678 946.3781 976.5395 1037.5589 1045.7138 1093.2013 1131.3942 1181.7189 1239.5965 1284.6876 1298.0333 1358.3784 1395.8006 1429.4087 1462.7216 1471.4376 1670.8826 1698.2550 2956.9606 2967.9844 3042.3790 3061.7855 3069.1150 3090.5882 3117.5160 3511.7690
redmass: 3.7183 2.1677 2.6839 1.2396 2.1923 4.0232 4.3693 2.1469 2.7072 3.5547 1.4176 1.5260 4.0608 1.9881 1.6811 1.0825 2.5744 1.5422 2.7482 2.0594 1.2546 1.4346 1.4401 1.2628 1.8334 1.2451 1.0870 1.0472 1.0575 8.4852 6.2163 1.0679 1.0367 1.0970 1.0903 1.0922 1.0983 1.0900 1.0639
irintensity: 0.3507 0.1630 2.6633 1.2181 4.3185 0.0985 10.2827 16.2592 25.5256 28.7854 135.9773 2.4078 2.7903 11.6744 28.5902 63.0800 253.0128 0.6764 10.8138 32.2454 2.4831 0.8567 13.5341 3.9824 47.9797 16.0068 36.5959 14.9567 16.4053 218.4277 0.8254 15.3207 34.1969 27.8291 4.6303 5.4037 42.2367 20.0499 18.9286
temp: 298.150 k
press: 1.00000 atm
elementType: 8 8 6 6 6 6 6 1 1 1 1 1 1 1 1
symmnumber: 1
zpe: 314837.3 jmol-1
zpe.correction: 0.119915 hartree
zpe.thermalcorrener: 0.128174 hartree
zpe.thermalcorrenthalpy: 0.129119 hartree
zpe.thermalcorrgfe: 0.086042 hartree
zpe.sumelectzpe: -345.214372 hartree
zpe.sumelectthermal: -345.206113 hartree
zpe.sumelectthermalent: -345.205168 hartree
zpe.sumelectthermalfe: -345.248245 hartree
dipole: 0.3958 -1.5276 0.0816
dipole: 1.5801
quadrupole: -33.9762 -46.3841 -41.7580
quadrupole: 0.6295 0.2840 0.4949
quadrupole: 6.7299 -5.6780 -1.0519 0.6295 0.2840 0.4949
hfenergy: -345.3342871 hartree
pointgroup: C01 [X(C5H8O2)]
dipole: -0.1557295 -0.5642215 0.2094461 debye
dipolederiv: -1.0758822 0.4081244 -0.2950866 0.3095762 -0.4448191 0.0990146 -0.3351911 0.1225647 -0.5595612 -0.6520847 -0.1376729 -0.0026111 0.0703398 -0.8946802 0.2564005 -0.1284813 0.1960425 -0.4287297 -0.1592619 -0.1013171 -0.0539766 -0.1954138 -0.1343161 0.0544581 -0.0146435 0.013102 0.1236706 0.0528181 -0.0421213 -0.0446124 -0.1814266 -0.0826982 -0.1529147 0.0412326 -0.1387589 -0.0757762 0.1608215 -0.1065631 -0.0722497 -0.1324585 -0.0160218 -0.1765753 -0.0462598 -0.1958171 -0.0349266 1.4768508 -0.0305841 0.3412583 -0.0427081 1.1785972 -0.4226056 0.4303672 -0.3795004 0.4881495 -0.1511428 0.0816918 0.0022311 0.0471194 0.0535949 0.0387318 0.0502269 0.0293984 0.0672329 -0.0266701 0.0338957 0.0581588 0.0720143 0.0431701 -0.0796039 0.0524157 -0.0963638 0.0161304 0.0446434 -0.0199538 0.0112136 0.0266091 0.0690152 0.0779911 -0.0209366 0.1086309 -0.0215084 0.0641933 0.0301356 0.0049419 0.0755032 0.0385056 0.1264831 0.0023218 0.117325 0.0446529 0.0405221 0.0642289 -0.0178268 0.05582 -0.0040309 0.1575343 -0.0136689 0.1528932 0.0038096 0.0181202 0.0474253 0.0584191 0.1132751 0.0531787 -0.0918685 0.0714306 -0.1027956 -0.0771412 0.0735397 -0.0322207 0.0473198 0.0354875 -0.0162537 0.1167314 -0.0197728 0.1382514 -0.0274807 -0.1010479 -0.0880512 -0.0378604 -0.1057303 -0.0182801 -0.0513543 -0.0892776 -0.0270476 0.1077879 0.2345806 -0.1070175 0.0006809 -0.1480073 0.1750383 0.0475773 0.0202366 0.0620753 0.3736903 unknown
polarizability: 83.967678|-0.6961583|52.4103692|-4.2842696|-7.1513854|45.2809846 unknown
InChI: InChI=1S/C5H8O2/c1-2-3-4-5(6)7/h2-3,6H,4H2,1H3
charge 0 multiplicity 1
15 atoms
O  2.73617 -0.508763 0.470179
O  1.695658 1.283575 -0.577054
C  0.431105 -0.81395 -0.151401
C  -0.880438 -0.09195 -0.376987
C  -2.016874 -0.351638 0.31795
C  1.629681 0.121267 -0.12449
C  -3.34346 0.338315 0.094981
H  0.626352 -1.536277 -0.974185
H  0.420716 -1.410037 0.777751
H  -0.87614 0.680884 -1.157592
H  -1.992994 -1.117242 1.110033
H  -3.691541 0.838975 1.01935
H  -3.274229 1.098681 -0.70239
H  -4.129297 -0.388625 -0.189241
H  3.515089 0.111583 0.447495
