program: Gaussian 09
title: 000237612
version: EM64L-G09RevD.01
frameworkgroup: C1[X(C12H14O3)]
method: RPBEPBE
basis: SDD
operation: Freq
keyword: #pfreq=noraman
keyword: PBEPBE/SDD
title: #p freq=noraman PBEPBE/SDD
converged: YES YES NO NO
title: Mulliken charges:
elementType: O O O C C C C C C C C C C C C H H H H H H H H H H H H H H
charge: -0.310553 -0.203558 -0.201853 -0.173106 -0.470581 -0.297482 0.212782 0.249130 0.323350 -0.353393 -0.544364 0.467176 -0.412359 -0.808541 -0.811663 0.263571 0.259618 0.235802 0.238693 0.241508 0.231392 0.236440 0.231465 0.258565 0.235805 0.217439 0.226130 0.222109 0.236478
chargesum: 0.00000
title: Mulliken charges with hydrogens summed into heavy atoms:
elementType: O O O C C C C C C C C C C C C
charge: -0.310553 -0.203558 -0.201853 0.090465 0.024839 0.182719 0.212782 0.249130 0.323350 -0.122001 -0.307924 0.467176 -0.180893 -0.096732 -0.126947
polarizability: 1.88063946e+02 -1.79453991e+00 1.29125397e+02 -1.61814927e+01 -3.99815391e+00 9.44495042e+01
1716.lowfreq: -3.5695 -0.0009 -0.0003 0.0002 8.3357 17.3144 24.5210 28.2842 34.6033
frequency: 22.8178 28.2052 34.4225 53.2634 100.5659 139.3271 148.5253 181.7140 199.7287 234.6598 244.5765 287.4751 323.6201 363.7062 434.5090 449.3958 470.5026 489.8495 555.1971 564.6097 635.1505 639.6249 668.3338 711.4200 716.2923 747.3782 810.8664 820.3666 843.8491 882.4952 886.6150 919.7410 931.7269 940.9849 959.3171 981.5364 1019.8350 1040.2407 1045.9135 1050.6789 1073.4895 1103.8456 1112.8010 1158.7972 1171.6996 1186.9658 1194.3945 1246.8925 1250.9622 1288.9842 1304.3960 1316.4715 1337.1971 1370.4852 1397.2415 1400.7975 1405.4016 1447.3722 1464.1386 1468.8353 1473.0430 1477.5625 1478.3140 1494.9349 1594.7597 1616.0697 1698.3663 2974.9827 2987.0935 3028.2923 3041.9825 3055.0034 3068.5227 3069.3463 3082.5422 3091.3730 3106.0340 3116.4293 3122.0480 3124.1874 3145.7654
redmass: 3.8299 1.1299 4.6288 4.3184 4.0048 1.0510 4.9803 3.2573 2.7315 5.2161 2.8155 2.8146 3.5421 4.4111 3.1918 4.8640 3.4505 4.5337 4.6367 3.2374 4.2664 5.1264 5.3993 5.1762 3.7256 3.9859 1.6055 2.8471 3.1080 2.5662 1.3714 3.1752 3.4756 1.3667 3.3067 1.4872 1.4880 2.0721 1.5263 1.5573 2.2630 2.8774 2.6713 1.5413 1.2076 1.4820 1.8444 2.1566 1.5545 1.7766 1.2529 1.3722 1.3724 6.5065 1.2820 1.3272 2.3860 1.0950 1.1050 1.2243 1.0862 1.0899 1.1898 1.8154 6.8953 6.3331 12.4339 1.0380 1.0364 1.0632 1.0600 1.0960 1.0875 1.0973 1.0994 1.1000 1.1019 1.0914 1.0871 1.1092 1.0971
irintensity: 2.0949 1.7961 2.5336 1.3423 2.5602 0.6819 0.9023 2.2672 4.4818 7.6386 2.2338 0.6688 3.7717 3.5611 5.2651 3.7877 4.3865 1.5079 0.4603 9.1894 1.5323 4.5801 6.3837 0.1887 0.5678 4.3328 30.9667 15.2826 37.7286 46.4049 7.2191 24.5477 26.3715 1.4380 39.2280 2.9855 4.0768 28.0788 4.2045 21.2321 114.0756 150.1741 55.3401 12.3488 18.0440 23.0272 59.3701 5.5228 1.1123 2.5184 8.3089 2.3547 0.1479 1.3846 9.9862 10.2241 4.5359 16.1766 9.9434 15.8191 7.9956 9.4385 23.0125 91.9987 0.2802 3.1038 227.3159 40.9456 21.5472 11.3987 38.1954 22.5587 13.0812 13.9408 18.7796 19.4889 7.1542 22.3304 18.2525 26.2673 15.8597
temp: 298.150 k
press: 1.00000 atm
elementType: 8 8 8 6 6 6 6 6 6 6 6 6 6 6 6 1 1 1 1 1 1 1 1 1 1 1 1 1 1
symmnumber: 1
zpe: 610854.3 jmol-1
zpe.correction: 0.232662 hartree
zpe.thermalcorrener: 0.247418 hartree
zpe.thermalcorrenthalpy: 0.248362 hartree
zpe.thermalcorrgfe: 0.188473 hartree
zpe.sumelectzpe: -690.225152 hartree
zpe.sumelectthermal: -690.210396 hartree
zpe.sumelectthermalent: -690.209452 hartree
zpe.sumelectthermalfe: -690.269341 hartree
dipole: 0.0385 -3.2119 -2.3850
dipole: 4.0008
quadrupole: -74.3019 -82.7676 -96.3214
quadrupole: -10.6094 -9.3709 -6.2990
quadrupole: 10.1617 1.6961 -11.8578 -10.6094 -9.3709 -6.2990
hfenergy: -690.4578137 hartree
pointgroup: C01 [X(C12H14O3)]
dipole: -0.0152731 -1.206682 -1.0105534 debye
polarizability: 188.1929366|-2.6806506|129.5845612|-15.6027778|-1.4593645|93.8613492 unknown
InChI: InChI=1S/C12H14O3/c1-8-3-4-10(9(2)7-8)15-11-5-6-14-12(11)13/h3-4,7,11H,5-6H2,1-2H3
charge 0 multiplicity 1
29 atoms
O  0.724165 -0.474704 -0.677632
O  3.427387 0.50718 0.649319
O  1.676344 0.618283 2.180547
C  1.647126 -1.077588 0.315868
C  2.883085 -1.583329 -0.43275
C  3.753274 -0.310285 -0.563603
C  2.19568 0.079022 1.191955
C  -0.656477 -0.392245 -0.316074
C  -1.271927 0.886615 -0.340601
C  -1.395556 -1.561767 -0.041332
C  -2.661432 0.942673 -0.075232
C  -3.431595 -0.211456 0.221795
C  -2.777334 -1.46824 0.230996
C  -0.465626 2.135336 -0.6367
C  -4.913282 -0.096354 0.537211
H  1.126085 -1.828122 0.932432
H  2.619516 -2.021693 -1.407748
H  3.404263 -2.342057 0.177646
H  4.837012 -0.496762 -0.536025
H  3.487564 0.290374 -1.449407
H  -0.90253 -2.540646 -0.065274
H  -3.155451 1.922709 -0.090814
H  -3.350876 -2.378562 0.441353
H  0.320844 2.287458 0.124986
H  0.043921 2.064538 -1.614393
H  -1.112796 3.028845 -0.643729
H  -5.417058 0.620636 -0.135955
H  -5.424528 -1.070011 0.440525
H  -5.074597 0.260349 1.573033
