program: Gaussian 09
title: 000237567
version: EM64L-G09RevD.01
frameworkgroup: C1[X(C8H11NO2)]
method: RPBEPBE
basis: SDD
operation: Freq
keyword: #p
keyword: freq=noraman
keyword: PBEPBE/SDD
title: #p freq=noraman PBEPBE/SDD
converged: YES YES NO NO
title: Mulliken charges:
elementType: O O N C C C C C C C C H H H H H H H H H H H
charge: -0.281499 -0.446248 -0.710963 0.274120 0.152816 -0.580698 0.540305 -0.428790 -0.321545 -0.450385 -0.535265 0.261733 0.237568 0.226690 0.233574 0.213907 0.300514 0.304706 0.215863 0.217437 0.240259 0.335900
chargesum: 0.00000
title: Mulliken charges with hydrogens summed into heavy atoms:
elementType: O O N C C C C C C C C
charge: -0.281499 -0.110348 -0.105743 0.274120 0.152816 -0.318965 0.540305 0.035468 -0.087971 -0.236477 0.138294
polarizability: 1.40192872e+02 -1.15339797e+00 1.11190602e+02 1.18345642e+00 -2.74120829e+00 5.49480405e+01
1716.lowfreq: -8.0219 -0.0008 -0.0006 -0.0001 3.7431 10.1310 65.2644 85.9702 137.8313
frequency: 65.2427 85.9605 137.8252 160.7429 191.7552 217.5408 241.8338 306.0267 335.2904 337.5063 354.7544 366.8005 369.6796 442.8989 447.7330 560.7852 567.0787 594.4072 706.6083 722.9749 749.8212 794.7082 880.6680 905.8647 935.3637 964.3291 981.7442 992.8487 1040.2218 1111.2155 1113.1770 1147.9689 1161.6287 1179.0586 1210.5017 1254.2563 1310.6175 1331.3701 1355.3925 1394.9535 1436.1202 1450.1954 1464.5812 1471.4034 1474.7311 1499.3688 1593.8050 1633.4302 1644.7198 2950.5381 2990.2086 3034.3226 3057.6411 3116.4541 3123.2373 3128.2487 3160.1686 3553.7365 3572.6435 3713.6504
redmass: 2.9576 3.1736 3.2226 4.5027 3.0304 3.3726 1.1426 1.1950 1.5121 1.3471 2.7190 2.6970 2.7041 2.7414 5.7542 3.6503 4.2735 3.5504 5.7457 3.2604 5.0633 1.4938 1.4435 1.3891 2.8318 2.7872 2.4284 6.6610 1.5160 2.4357 1.2909 1.3772 1.1400 1.3879 2.3810 1.5520 1.3158 2.8250 1.4008 4.1418 1.1850 2.4408 1.0528 1.2094 1.1668 2.7155 7.4935 1.6691 2.3887 1.0332 1.0628 1.1035 1.0997 1.0986 1.0889 1.0906 1.0938 1.0659 1.0447 1.1041
irintensity: 1.7248 8.2459 2.6501 0.3678 1.8709 11.6946 0.7100 338.1570 33.2990 16.7248 28.4971 52.7809 50.3906 9.5580 3.7386 16.4395 1.6038 5.9809 24.4489 2.2005 1.2163 52.5886 35.0733 0.1846 30.7709 57.8437 6.8065 61.0669 5.4799 11.3891 0.6518 2.3709 14.4234 17.7832 185.5996 11.6449 7.7234 18.0702 47.6665 9.8914 13.9864 2.1042 12.6783 10.7039 115.8829 185.1868 5.8433 19.6476 178.2240 78.3437 30.4104 54.9970 17.0281 30.7991 13.0968 13.5164 16.2450 6.1935 60.8567 18.9218
temp: 298.150 k
press: 1.00000 atm
elementType: 8 8 7 6 6 6 6 6 6 6 6 1 1 1 1 1 1 1 1 1 1 1
symmnumber: 1
zpe: 467131.9 jmol-1
zpe.correction: 0.177921 hartree
zpe.thermalcorrener: 0.189392 hartree
zpe.thermalcorrenthalpy: 0.190337 hartree
zpe.thermalcorrgfe: 0.141108 hartree
zpe.sumelectzpe: -515.792177 hartree
zpe.sumelectthermal: -515.780705 hartree
zpe.sumelectthermalent: -515.779761 hartree
zpe.sumelectthermalfe: -515.828990 hartree
dipole: 0.8524 -3.1864 1.1092
dipole: 3.4799
quadrupole: -47.4059 -66.5742 -67.2980
quadrupole: 1.6812 0.1553 2.8487
quadrupole: 13.0202 -6.1482 -6.8720 1.6812 0.1553 2.8487
hfenergy: -515.9700978 hartree
pointgroup: C01 [X(C8H11N1O2)]
dipole: 0.6441129 1.0969738 -0.5061972 debye
dipolederiv: -1.4347271 0.5661967 0.0835847 0.4517289 -0.585755 -0.0253002 0.0998073 -0.0297774 -0.291795 -0.5562137 -0.0736683 -0.0315351 -0.1105193 -0.8360201 -0.1842738 -0.0509721 -0.2615074 -0.2023162 -1.5264729 0.279633 0.0604868 0.2863881 -0.148215 -0.0869564 0.0967013 -0.0937862 -0.7683655 -0.0574874 -0.163474 0.0044966 0.2409846 0.0909815 -0.0920678 -0.0517632 -0.0651252 -0.044069 1.1256596 -0.4897586 -0.1038961 -0.263972 -0.1900806 0.0496218 -0.1367361 0.0453603 0.0200025 -0.3138024 0.2168235 -0.0101626 -0.2774803 0.0186894 -0.0133734 0.0514754 -0.0536492 -0.2474215 1.5604258 -0.313711 -0.1192854 -0.3816583 -0.0705784 0.0602976 -0.1236362 0.055536 0.1410018 0.3051502 -0.0241073 -0.0008882 0.001134 0.6695267 0.1267527 0.0328808 0.2145079 0.3126143 -0.0024848 0.2788364 -0.0404134 -0.1528971 0.0628459 -0.0110922 0.0037133 -0.0414811 -0.1579719 -0.2688762 -0.1418406 0.01388 0.4409791 0.0344611 -0.0708441 -0.0415907 -0.0095789 -0.2394075 0.422391 -0.1768999 0.0053873 -0.4898185 0.6387132 0.0284596 0.0339337 -0.0171507 0.333286 0.0604112 0.0935777 0.0038967 0.0906924 -0.0225931 0.011998 0.0122697 0.0179525 0.1636223 0.0742436 -0.0106526 0.037181 -0.0601511 -0.028661 0.0317193 0.0697213 0.024497 -0.0927132 -0.1014502 0.0183375 -0.0616855 0.0522494 0.008609 -0.0037076 -0.096497 -0.0020773 0.0377002 0.0760383 0.0721614 0.0018026 0.0785125 -0.0908825 0.0096882 0.0073013 0.0125334 0.1579709 -0.0536939 -0.1098552 0.0326535 -0.1041514 -0.0302627 0.0264228 0.0342101 0.0311879 0.1642687 0.1998856 -0.006971 0.0159594 0.0025529 0.1046938 0.0216967 0.0022721 0.0200446 0.3875157 0.1951179 -0.022281 0.0197967 -0.0389097 0.1257426 0.0302603 0.0075066 0.0343215 0.3840189 0.0810567 -0.0506894 0.0772587 0.1087193 -0.0599548 0.0705556 -0.010864 0.1206846 -0.1300286 0.0610961 -0.0915594 -0.0988588 0.0858327 -0.1024398 -0.0985713 -0.045063 -0.1084377 -0.0652372 -0.168985 0.0427948 0.0268818 -0.0133385 0.0796256 0.0046732 0.0302504 -0.0005943 0.1165892 0.3227176 0.1071073 0.0834596 0.0531223 0.331554 0.1140409 0.0750791 0.1065396 0.0207349 unknown
polarizability: 137.3753399|-7.3800627|112.9683422|-9.2268268|-2.1796528|55.9878332 unknown
InChI: InChI=1S/C8H11NO2/c1-11-8-3-2-7(9)4-6(8)5-10/h2-4,10H,5,9H2,1H3
charge 0 multiplicity 1
22 atoms
O  -2.169841 0.807758 0.262494
O  -0.762749 -3.140724 -0.088902
N  3.383253 -0.165881 -0.268195
C  -0.301235 -0.696851 0.1687
C  -0.769601 0.646387 0.11363
C  1.078515 -0.948436 0.040597
C  2.01492 0.109076 -0.145267
C  -1.289132 -1.840495 0.359857
C  0.14448 1.706638 -0.074774
C  1.525591 1.440835 -0.203393
C  -2.694451 2.168327 0.177584
H  1.420979 -1.988519 0.100934
H  -1.50967 -1.995673 1.43061
H  -2.245246 -1.596945 -0.143634
H  -0.20043 2.744071 -0.123087
H  2.224606 2.273574 -0.348224
H  4.056998 0.585043 -0.379313
H  3.729344 -1.117324 -0.196006
H  -2.470856 2.62944 -0.805266
H  -2.287782 2.809734 0.984653
H  -3.783512 2.06858 0.300115
H  -0.552182 -3.073815 -1.055114
