program: Gaussian 09
title: 000237585
version: EM64L-G09RevD.01
frameworkgroup: C1[X(C10H14ClN3O3S)]
method: RPBEPBE
basis: SDD
operation: Freq
keyword: #p
keyword: freq=noraman
keyword: PBEPBE/SDD
title: #p freq=noraman PBEPBE/SDD
converged: YES YES NO NO
title: Mulliken charges:
elementType: Cl S O O O N N N C C C C C C C C C C H H H H H H H H H H H H H H
charge: -0.027195 0.989181 -0.478311 -0.498964 -0.542103 -0.663096 -0.139193 -0.660954 -0.019911 -0.045915 -0.457193 0.325274 -0.237436 -0.235601 -0.708389 -0.186461 -0.187357 -0.102924 0.207447 0.237990 0.195832 0.346446 0.327324 0.290933 0.233165 0.198271 0.245903 0.283005 0.268523 0.373053 0.321644 0.347011
chargesum: 0.00000
title: Mulliken charges with hydrogens summed into heavy atoms:
elementType: Cl S O O O N N N C C C C C C C C C C
charge: -0.027195 0.989181 -0.105257 -0.498964 -0.542103 -0.316650 -0.139193 0.007701 -0.019911 0.161533 -0.023371 0.325274 0.089888 0.055333 -0.031050 0.096544 0.081165 -0.102924
polarizability: 2.22778927e+02 1.30372580e+01 1.90444919e+02 -7.41038659e+00 1.27127489e+01 1.20171964e+02
1716.lowfreq: -9.8553 -4.6777 0.0007 0.0007 0.0016 7.6494 24.3228 29.8364 50.0331
frequency: 23.6131 29.6763 49.9768 53.8662 68.5254 85.0860 89.7326 117.1707 133.6241 167.5984 210.6976 214.3414 226.8687 231.3184 249.9524 260.1126 268.3354 302.2917 355.1680 365.1002 374.3585 380.5230 399.5553 409.8138 414.1112 428.4010 442.9182 490.0223 509.7210 584.5124 602.6003 609.9281 628.1063 656.7962 695.9059 704.6160 726.0653 799.8259 807.2230 830.1468 841.5499 869.4045 922.0845 929.0403 953.3447 959.4466 972.0469 980.5674 1005.4632 1031.4355 1046.6917 1066.6310 1089.0193 1104.9074 1108.2460 1121.0710 1174.6584 1215.2035 1238.0259 1244.5498 1281.7424 1332.0807 1341.8030 1372.0865 1379.8329 1380.7673 1384.3498 1392.9144 1446.4750 1449.1338 1467.7540 1482.8837 1565.9739 1596.1805 1610.9029 1659.8847 2921.0599 2973.9415 2982.0363 3025.3469 3068.8567 3092.1418 3160.6694 3174.8793 3181.0688 3189.9799 3361.8315 3526.9406 3543.8673 3688.7112
redmass: 6.6834 4.9678 4.8614 4.5625 4.5935 4.8116 5.7562 8.6641 8.5699 6.8341 11.1116 2.9520 4.6302 3.7398 4.0530 1.5586 3.1939 5.5670 2.0719 3.7405 1.2974 6.1403 2.6861 2.6649 2.7609 1.6366 1.9272 6.4289 3.5061 4.0761 3.5478 5.1009 1.2020 5.0579 5.1920 4.7602 5.1058 3.2883 14.9138 1.2835 1.3692 2.6101 2.4317 2.1732 12.8829 1.3165 1.3900 6.5478 1.8534 1.7138 2.5735 3.3365 1.7977 1.6380 1.5028 2.4394 1.1307 1.4172 1.4271 1.2619 1.2341 1.4304 1.3083 1.5145 2.4804 2.3798 3.3962 1.8719 1.0934 2.0987 1.0646 1.0507 6.1861 8.2144 1.1988 5.8876 1.0570 1.0370 1.1014 1.0873 1.0984 1.0998 1.0895 1.0891 1.0969 1.0978 1.0645 1.0784 1.0453 1.1041
irintensity: 1.9217 3.6719 3.4880 1.2069 3.2165 3.9324 6.8321 3.1059 3.7651 1.6079 2.5215 14.9205 3.1928 0.5311 4.7035 0.3974 0.1953 4.5483 3.9302 1.2254 25.6653 45.2400 96.4052 0.6268 4.9699 228.3362 91.4469 18.1540 93.9215 49.5045 10.8345 12.2569 93.7338 27.8946 14.2545 7.3239 91.9442 22.6275 122.8091 21.0749 26.6078 23.8460 26.1833 14.4183 71.5596 0.6139 0.6355 26.8386 12.2041 46.0709 28.8153 62.4617 8.5014 2.4696 5.5025 66.4097 5.7988 23.0317 36.3947 10.5524 2.0885 4.0493 7.8305 68.6911 10.6448 153.6433 10.7779 198.2039 27.0049 43.9616 12.1811 8.2717 40.1183 2.3316 117.3366 354.9821 59.6194 17.3501 40.7420 55.2702 59.2274 27.0882 2.0599 3.2359 1.1100 4.7281 73.7195 46.6748 56.0541 25.4030
temp: 298.150 k
press: 1.00000 atm
elementType: 17 16 8 8 8 7 7 7 6 6 6 6 6 6 6 6 6 6 1 1 1 1 1 1 1 1 1 1 1 1 1 1
symmnumber: 1
zpe: 621506.0 jmol-1
zpe.correction: 0.236719 hartree
zpe.thermalcorrener: 0.256610 hartree
zpe.thermalcorrenthalpy: 0.257554 hartree
zpe.thermalcorrgfe: 0.186834 hartree
zpe.sumelectzpe: -1635.953589 hartree
zpe.sumelectthermal: -1635.933698 hartree
zpe.sumelectthermalent: -1635.932753 hartree
zpe.sumelectthermalfe: -1636.003474 hartree
dipole: -3.7114 -0.7906 -4.0379
dipole: 5.5412
quadrupole: -97.0339 -131.9830 -123.7650
quadrupole: -4.2414 12.4514 12.5898
quadrupole: 20.5601 -14.3891 -6.1710 -4.2414 12.4514 12.5898
hfenergy: -1636.1903077 hartree
pointgroup: C01 [X(C10H14Cl1N3O3S1)]
dipole: 0.9933035 -0.7466376 1.7912391 debye
polarizability: 210.0281588|-19.1986611|202.9744894|1.867865|-16.8058766|120.393162 unknown
InChI: InChI=1S/C10H14ClN3O3S/c1-7(15)6-13-10(12)14-18(16,17)9-4-2-8(11)3-5-9/h2-5,7,14-15H,6,12H2,1H3
charge 0 multiplicity 1
32 atoms
Cl -4.182659 3.014731 -0.248632
S  -0.128631 -1.987137 -0.527215
O  1.590681 2.528277 0.288585
O  0.958541 -1.717996 -1.697769
O  -1.015459 -3.350006 -0.461319
N  0.713689 -2.067754 1.103447
N  1.846082 -0.014796 1.062395
N  2.803234 -1.94621 2.167783
C  -1.295752 -0.514697 -0.435143
C  2.944499 1.959485 0.168742
C  3.064397 0.80655 1.206887
C  1.823466 -1.266496 1.433398
C  -0.862057 0.715339 -0.951254
C  -2.567764 -0.734298 0.117179
C  3.219233 1.475732 -1.267315
C  -1.755441 1.807757 -0.890338
C  -3.459883 0.35968 0.168552
C  -3.034097 1.609769 -0.329091
H  3.641241 2.775434 0.436153
H  3.105609 1.250746 2.224296
H  4.004291 0.234782 1.036116
H  0.512142 -2.956516 1.5730
H  0.132505 0.827276 -1.390323
H  -2.86162 -1.725913 0.474523
H  2.966732 2.276196 -1.983989
H  4.287149 1.216329 -1.401965
H  2.614089 0.580962 -1.504815
H  -1.448685 2.788738 -1.26166
H  -4.463314 0.240232 0.585803
H  1.023547 1.743982 0.550933
H  2.905203 -2.957075 2.109378
H  3.517733 -1.416503 2.660957
