program: Gaussian 09
title: 000237577
version: EM64L-G09RevD.01
frameworkgroup: C1[X(C8H8Cl6N2O2)]
method: RPBEPBE
basis: SDD
operation: Freq
keyword: #p
keyword: freq=noraman
keyword: PBEPBE/SDD
title: #p freq=noraman PBEPBE/SDD
converged: YES YES NO NO
title: Mulliken charges:
elementType: Cl Cl Cl Cl Cl Cl O O N N C C C C C C C C H H H H H H H H
charge: 0.078496 0.170885 0.097328 0.097282 0.170883 0.078558 -0.226445 -0.226423 -0.100064 -0.100074 -0.375472 -0.401002 -0.400985 -0.375463 0.455087 0.455053 -0.738147 -0.738124 0.278060 0.245078 0.252498 0.263709 0.263704 0.252468 0.245056 0.278054
chargesum: 0.00000
title: Mulliken charges with hydrogens summed into heavy atoms:
elementType: Cl Cl Cl Cl Cl Cl O O N N C C C C C C C C
charge: 0.078496 0.170885 0.097328 0.097282 0.170883 0.078558 -0.226445 -0.226423 -0.100064 -0.100074 0.147666 0.115205 0.115187 0.147647 0.455087 0.455053 -0.738147 -0.738124
polarizability: 2.13424448e+02 2.33691405e+01 1.54812573e+02 3.32025437e+00 4.25072927e+00 1.34828911e+02
1716.lowfreq: -5.6908 0.0026 0.0028 0.0032 4.5281 13.5677 17.2803 34.1095 50.0872
frequency: 17.2800 34.1093 50.0393 65.5320 71.7865 75.6098 86.2770 122.9709 159.6024 173.5614 178.1864 224.6501 241.3906 246.4961 259.3211 265.7106 267.3373 280.1838 307.3807 335.9218 338.7628 373.1297 376.1113 408.2468 432.3304 455.4668 477.5539 546.8236 586.2071 587.4751 623.6396 628.6139 741.8512 742.2435 742.9899 746.0536 770.4144 772.0769 836.3906 916.1735 931.8279 985.9593 1021.7918 1042.9172 1043.6966 1100.3622 1143.1446 1194.9236 1206.3059 1219.0784 1229.6092 1280.6896 1339.5826 1344.1519 1353.1812 1355.8786 1398.5825 1407.4217 1458.8327 1461.5269 1464.8626 1468.9965 1597.0702 1597.5453 2995.6134 2997.6178 3007.1604 3010.6818 3105.7890 3105.9101 3141.4146 3141.7828
redmass: 12.3587 25.2341 13.4808 10.7926 10.5177 12.4226 5.2713 13.4549 9.9159 13.8627 15.7277 8.2942 12.5058 11.9314 13.6004 19.7149 16.4369 8.1602 2.7271 3.0504 10.2946 14.4834 19.7687 5.6411 2.0479 2.6759 8.3579 4.7401 10.8648 11.4259 6.7911 2.2641 10.2568 7.3254 11.8985 7.5194 9.5344 7.8444 1.6164 4.5167 3.4748 2.6238 2.8644 2.9003 1.8581 2.4987 4.4259 2.1593 1.7202 1.6148 1.8160 1.3556 1.2347 1.2647 1.4540 1.3610 2.2861 2.3506 1.0757 1.0770 1.1133 1.1054 9.0205 9.9509 1.0692 1.0693 1.0669 1.0673 1.0978 1.0979 1.0934 1.0935
irintensity: 1.0486 0.8178 0.0000 1.5557 0.0007 6.6494 0.0000 0.0000 6.4980 0.0000 1.7439 0.0000 7.6383 0.0000 0.9907 0.0000 0.7836 0.0000 1.8458 4.4174 0.0004 6.6239 0.0001 27.1092 0.0000 0.0000 0.0000 31.7685 248.1298 0.0127 0.0009 36.5893 164.8764 0.0037 0.0413 203.2083 0.0369 129.9691 0.0000 0.0001 85.6724 51.6131 29.0592 0.0014 7.9645 0.0001 26.2300 0.0000 207.7892 0.0001 0.0001 42.9865 0.0001 2.0932 29.2679 0.0001 0.0004 122.5702 22.1178 0.0018 58.3806 0.0001 533.3193 0.1286 12.5746 0.0000 0.0000 71.7746 9.6895 0.0104 3.0702 0.0281
temp: 298.150 k
press: 1.00000 atm
elementType: 17 17 17 17 17 17 8 8 7 7 6 6 6 6 6 6 6 6 1 1 1 1 1 1 1 1
symmnumber: 1
zpe: 422998.4 jmol-1
zpe.correction: 0.161112 hartree
zpe.thermalcorrener: 0.180363 hartree
zpe.thermalcorrenthalpy: 0.181307 hartree
zpe.thermalcorrgfe: 0.110511 hartree
zpe.sumelectzpe: -3328.557757 hartree
zpe.sumelectthermal: -3328.538505 hartree
zpe.sumelectthermalent: -3328.537561 hartree
zpe.sumelectthermalfe: -3328.608357 hartree
dipole: 0.0012 0.0005 -0.0042
dipole: 0.0044
quadrupole: -169.2465 -154.5067 -143.4012
quadrupole: -12.7389 -1.5413 -0.2844
quadrupole: -13.5284 1.2114 12.3169 -12.7389 -1.5413 -0.2844
hfenergy: -3328.7188683 hartree
pointgroup: C01 [X(C8H8Cl6N2O2)]
dipole: -0.0004896 -0.0002148 -0.0016353 debye
dipolederiv: -0.3067146 -0.0897765 -0.1112272 -0.0386953 -0.4151665 -0.3180638 -0.0628458 -0.3123963 -0.5069888 -0.592883 -0.2416042 0.0942362 -0.2329631 -0.1724325 0.0485583 0.106335 0.0532707 -0.1163097 -0.2622481 0.0350776 -0.0284902 0.0880469 -0.3021883 0.2931671 -0.092893 0.2848434 -0.6310961 -0.2624225 0.0353276 -0.028663 0.0883141 -0.3033815 0.2938556 -0.0929263 0.2854915 -0.6302806 -0.593007 -0.2415769 0.0940195 -0.2329307 -0.172364 0.0485207 0.1063656 0.0532419 -0.1162239 -0.3068765 -0.0899492 -0.1117704 -0.038836 -0.4137967 -0.3176215 -0.0632934 -0.3119731 -0.5076336 -0.7951749 0.0094016 0.0496247 -0.5360037 -0.9018125 0.101384 0.1543959 0.0636313 -0.2746398 -0.7947279 0.0095348 0.0497454 -0.5358647 -0.9017733 0.1011437 0.1563442 0.0643531 -0.2748825 -1.3188334 -0.2090389 0.0721341 -0.0572596 -0.4638828 0.0158541 0.0534958 0.0363883 -0.3078486 -1.3182522 -0.2089155 0.0731538 -0.0571231 -0.4638963 0.0158849 0.0542696 0.0363108 -0.3081988 0.342232 -0.1467324 -0.0212136 -0.4505392 0.1137219 0.065047 0.0330995 0.0303578 0.1977909 0.1422284 0.1682235 -0.013561 0.3794709 0.3184299 -0.0806674 -0.0033521 -0.0550329 0.2351697 0.1420033 0.1682015 -0.0138298 0.3792826 0.318474 -0.0806209 -0.0040716 -0.0551826 0.2354375 0.3421648 -0.1467563 -0.0212472 -0.4504243 0.1137744 0.065262 0.032757 0.0303276 0.1979888 1.6129327 0.0780101 -0.2133417 0.4109168 0.8693189 -0.108022 -0.3450874 -0.100659 0.0262923 1.6116245 0.0778301 -0.2147148 0.4105534 0.8693935 -0.1074495 -0.3487077 -0.1007523 0.0269426 1.0322307 0.42932 0.0539467 0.4042056 0.7956154 -0.0383556 0.0768278 -0.0313532 1.3446832 1.0329558 0.4291356 0.0550953 0.4040988 0.7952427 -0.0398678 0.0784106 -0.0329456 1.3443651 0.110754 -0.0915738 0.0009855 0.0233804 0.0182201 0.0116029 -0.0302989 0.0321146 0.1045847 -0.0136091 0.049832 0.0600911 0.0625369 0.0877519 0.0453451 0.0577778 -0.0124869 -0.0814338 0.0237849 -0.0631195 0.0625599 -0.0735912 0.0337642 -0.0328257 0.067003 0.0303267 -0.0844888 0.0254962 0.071982 -0.0056922 0.0205767 0.0186267 -0.0030644 -0.01431 -0.0189763 0.0941865 0.0256193 0.071993 -0.005622 0.0206 0.0186209 -0.0031649 -0.0138486 -0.0189351 0.0941148 0.0237835 -0.0631073 0.062663 -0.0735463 0.0337695 -0.0327859 0.0670812 0.0303867 -0.0845894 -0.0137605 0.0498575 0.0602067 0.0624614 0.0877703 0.0453217 0.0578297 -0.0125163 -0.0815312 0.1106996 -0.0915763 0.0009112 0.0233325 0.0182001 0.0115625 -0.0303581 0.0321652 0.1045892 unknown
polarizability: 216.5537556|18.3854579|151.3100265|-5.2873172|-4.7088167|135.2021491 unknown
InChI: InChI=1S/C8H8Cl6N2O2/c9-7(10,11)5(17)15-1-2-16(4-3-15)6(18)8(12,13)14/h1-4H2
charge 0 multiplicity 1
26 atoms
Cl 3.421072 -1.537839 -1.445633
Cl 5.389302 0.490245 -0.414585
Cl 3.970265 -1.268899 1.567912
Cl -3.968084 1.272151 -1.554601
Cl -5.38646 -0.489584 0.426149
Cl -3.416343 1.535769 1.458908
O  2.930642 1.962203 -0.125992
O  -2.927965 -1.961917 0.136818
N  1.358751 0.32008 0.355911
N  -1.356462 -0.320108 -0.347414
C  0.294648 1.352939 0.446045
C  0.840556 -1.052943 0.569016
C  -0.838258 1.052904 -0.56051
C  -0.292369 -1.352975 -0.437519
C  2.639604 0.747574 0.060766
C  -2.637285 -0.74753 -0.052059
C  3.785222 -0.319678 -0.045908
C  -3.782266 0.320112 0.05745
H  0.745924 2.334076 0.232622
H  -0.114196 1.358742 1.474907
H  0.447183 -1.122458 1.601756
H  1.631843 -1.803845 0.454767
H  -1.629552 1.80381 -0.4463
H  -0.444866 1.122374 -1.593241
H  0.116443 -1.358797 -1.466391
H  -0.743648 -2.334104 -0.224072
