program: Gaussian 09
title: 000237557
version: EM64L-G09RevD.01
frameworkgroup: C1[X(C6H9NO3)]
method: RPBEPBE
basis: SDD
operation: Freq
keyword: #pfreq=noraman
keyword: PBEPBE/SDD
title: #p freq=noraman PBEPBE/SDD
converged: NO YES NO NO
title: Mulliken charges:
elementType: O O O N C C C C C C H H H H H H H H H
charge: -0.222677 -0.192762 -0.189175 -0.422750 -0.151308 -0.355770 -0.344310 0.178359 -0.692104 0.240136 0.262423 0.231283 0.214702 0.233498 0.193998 0.216102 0.211184 0.224487 0.364684
chargesum: 0.00000
title: Mulliken charges with hydrogens summed into heavy atoms:
elementType: O O O N C C C C C C
charge: -0.222677 -0.192762 -0.189175 -0.058067 0.111115 0.090214 0.083186 0.178359 -0.040331 0.240136
polarizability: 9.50999328e+01 7.85444048e+00 8.65693937e+01 5.68684554e+00 9.45651151e-01 5.53333146e+01
1716.lowfreq: -13.4338 -10.1705 -5.9119 -0.0010 -0.0009 0.0006 54.1787 78.5341 102.0014
frequency: 54.1308 78.4989 101.9947 139.2246 162.1452 229.9386 265.5124 301.8650 383.6340 428.9671 561.0004 603.8750 625.3373 665.9540 678.7507 729.1807 743.2084 813.4988 876.3627 894.4200 914.4792 923.5460 1046.8664 1069.8166 1102.7843 1111.5887 1128.7656 1221.4627 1233.6691 1267.5692 1283.7895 1292.6858 1319.3783 1325.7140 1357.3318 1393.5146 1451.2899 1475.5040 1478.7466 1486.1892 1691.2540 1750.4403 2977.7834 2979.0028 2989.6183 3025.4499 3034.6205 3056.5386 3077.5961 3081.3979 3585.1874
redmass: 4.2466 1.6523 4.7401 3.5334 7.4935 1.1241 5.0619 3.0321 8.7350 3.6095 3.9484 10.3250 4.8852 2.0725 4.1371 2.3389 1.2687 2.6555 2.5158 2.2145 2.5156 2.8023 3.0805 2.1515 3.0295 2.7265 1.8738 1.3809 1.4101 3.3891 1.4996 1.1596 1.3219 1.6427 1.5669 1.2110 1.0799 1.0514 1.0431 1.0801 8.9234 12.1123 1.0528 1.0457 1.0601 1.0894 1.0929 1.1019 1.1014 1.0991 1.0802
irintensity: 0.1364 0.0444 1.6413 6.3128 7.2547 0.0736 5.3271 0.7738 12.2862 2.4420 16.0445 5.2689 10.2726 36.3330 3.0503 119.3646 8.0964 16.8838 25.7025 14.1775 22.4073 39.6351 22.0733 20.0871 54.3992 80.9927 21.3256 6.5454 6.2854 150.8613 51.7180 3.7940 3.4351 15.9447 0.8560 10.7950 6.2909 4.7713 12.9431 15.9251 562.9079 340.7717 31.3261 14.5802 26.5410 2.4080 4.3653 8.1988 74.3753 41.3254 76.8701
temp: 298.150 k
press: 1.00000 atm
elementType: 8 8 8 7 6 6 6 6 6 6 1 1 1 1 1 1 1 1 1
symmnumber: 1
zpe: 391604.0 jmol-1
zpe.correction: 0.149154 hartree
zpe.thermalcorrener: 0.159093 hartree
zpe.thermalcorrenthalpy: 0.160037 hartree
zpe.thermalcorrgfe: 0.112991 hartree
zpe.sumelectzpe: -513.713904 hartree
zpe.sumelectthermal: -513.703965 hartree
zpe.sumelectthermalent: -513.703021 hartree
zpe.sumelectthermalfe: -513.750067 hartree
dipole: 1.7367 1.3246 0.0895
dipole: 2.1860
quadrupole: -55.1631 -76.0820 -56.4478
quadrupole: -6.1430 1.2733 0.2431
quadrupole: 7.4012 -13.5177 6.1165 -6.1430 1.2733 0.2431
hfenergy: -513.8630578 hartree
pointgroup: C01 [X(C6H9N1O3)]
dipole: -0.6894066 -0.5124389 0.0425118 debye
dipolederiv: -1.201898 -0.2202127 0.2081214 -0.1890176 -0.5188019 -0.0041494 0.2721687 0.0433127 -0.3680171 -0.4763187 0.0039588 0.0352627 -0.0670978 -1.1459071 0.0166675 0.0454137 -0.0637447 -0.3410707 -0.8578814 -0.3925375 0.1160249 -0.4543713 -0.9566496 0.0839632 0.1793368 0.1122795 -0.3785341 -0.7418329 -0.4458601 0.0612219 -0.2216455 -1.374611 0.0140391 0.1461105 0.0869575 -0.36507 0.1330508 0.2979879 0.0853539 0.5225084 0.2627685 -0.1151363 0.117505 -0.0944625 0.3053941 0.0530659 -0.0262318 -0.035302 0.0180731 0.0304767 -0.0255395 0.0172135 -0.0696087 0.0519709 0.0649377 0.0183989 -0.0447808 -0.0516815 0.1162256 -0.0332085 -0.1036574 -0.0322905 0.124229 0.961929 0.4882916 -0.2024833 0.1516778 1.5234993 -0.0359234 -0.3331302 -0.0573024 0.2779602 -0.057612 0.0290217 -0.0384827 0.060141 0.0782777 -0.008507 0.0012129 -0.0153411 0.0515521 1.6631479 0.3780976 -0.3803986 0.4000834 1.9126741 -0.005988 -0.4987052 -0.0309064 0.485919 0.0790393 -0.0281677 0.0300036 -0.0645661 0.0303011 0.0129339 0.0093427 0.042596 -0.0602149 0.0241936 -0.0470601 0.0038543 -0.0301252 -0.0882609 -0.003615 -0.0079146 0.006223 0.0937054 0.0250424 0.0011088 0.0450241 0.0155123 0.0722034 0.0570616 0.042911 0.0267161 -0.1154279 0.0384347 -0.0786835 -0.0189906 -0.0523087 -0.1044093 -0.0274452 -0.0046451 -0.0073592 0.0755414 0.0276131 0.0186201 0.0083295 0.0123199 0.0505925 0.0868669 0.0265724 0.0502401 -0.1804422 0.0691817 -0.0294687 0.0605634 -0.0212213 0.0729531 0.0702123 -0.0055337 0.0712849 -0.1491656 0.0470664 -0.0540739 -0.0238952 -0.1212225 -0.146164 -0.0185883 -0.0273557 0.0057017 0.0804434 -0.1081734 0.1095434 0.0464639 0.1340601 0.012305 -0.0567673 0.0650433 -0.0635079 0.0552083 0.2570139 -0.022733 0.0441095 -0.0411187 0.1725267 -0.0068767 0.0581114 -0.0107879 0.3560185 unknown
polarizability: 95.2685503|7.6781864|86.3562788|-5.8552836|-1.2654722|55.3778119 unknown
InChI: InChI=1S/C6H9NO3/c1-2-3-4-5(8)7-6(9)10-4/h4,7H,2-3H2,1H3
charge 0 multiplicity 1
19 atoms
O  0.437008 1.06384 0.428233
O  0.856374 -2.506714 -0.030952
O  2.497055 1.897604 -0.329582
N  1.989778 -0.433806 -0.301261
C  -0.178701 -0.300255 0.557397
C  -1.492031 -0.383101 -0.233475
C  -2.597443 0.523387 0.351767
C  0.913706 -1.261287 0.053313
C  -3.898851 0.455573 -0.47412
C  1.741855 0.947647 -0.095394
H  -0.358207 -0.463794 1.636541
H  -1.814655 -1.443185 -0.224174
H  -1.295655 -0.112118 -1.289091
H  -2.22867 1.56561 0.390857
H  -2.803027 0.219338 1.398308
H  -3.728437 0.792933 -1.513332
H  -4.295053 -0.576279 -0.51535
H  -4.681502 1.10041 -0.03624
H  2.873757 -0.770101 -0.684647
