program: Gaussian 09
title: 000237607
version: EM64L-G09RevD.01
frameworkgroup: C1[X(C14H20N2O3)]
method: RPBEPBE
basis: SDD
operation: Freq
keyword: #p
keyword: freq=noraman
keyword: PBEPBE/SDD
title: #p freq=noraman PBEPBE/SDD
converged: YES YES NO NO
title: Mulliken charges:
elementType: O O O N N C C C C C C C C C C C C C C H H H H H H H H H H H H H H H H H H H H
charge: -0.272624 -0.301863 -0.285433 -0.442937 -0.474089 -0.335444 -0.361484 -0.356018 -0.535865 -0.692336 0.232594 0.319238 0.222507 0.177659 -0.314228 -0.325858 -0.240476 -0.248173 -0.528206 0.188271 0.186233 0.236640 0.201983 0.199661 0.197134 0.216756 0.239805 0.209662 0.210545 0.218695 0.341488 0.429388 0.304077 0.238023 0.225878 0.223861 0.222186 0.222142 0.250610
chargesum: 0.00000
title: Mulliken charges with hydrogens summed into heavy atoms:
elementType: O O O N N C C C C C C C C C C C C C C
charge: -0.272624 -0.301863 -0.285433 -0.101448 -0.044702 0.039059 0.077139 0.040777 -0.079304 -0.053434 0.232594 0.319238 0.222507 0.177659 -0.010151 -0.087835 -0.014598 -0.024312 0.166731
polarizability: 2.66030048e+02 -3.56761206e-01 1.89893369e+02 -1.45602205e+01 -5.26627048e+00 1.04377905e+02
1716.lowfreq: -13.8779 -3.3420 -0.0014 -0.0011 -0.0008 4.6710 6.4243 25.0901 34.4730
frequency: -7.0229 24.5130 34.2547 41.4396 71.8393 83.3635 94.2521 101.0567 114.7880 127.2502 153.8656 164.2166 196.8255 204.1308 230.8745 242.4826 250.6690 261.0452 304.9299 322.3071 363.8102 402.0977 422.5076 462.6400 484.4823 511.2556 559.8701 569.0822 589.6349 662.2369 677.6155 724.9018 726.1190 734.2215 740.5341 753.2975 756.0841 773.0756 840.4342 844.7486 853.7635 894.4474 934.4726 939.1438 941.5144 961.0361 977.2251 982.4240 995.8608 1010.9537 1043.4162 1057.1948 1078.1140 1093.6136 1111.9408 1115.9546 1116.3442 1152.2461 1174.1895 1175.5480 1196.3920 1205.5458 1224.9335 1245.4321 1262.7672 1266.7672 1289.8815 1292.3840 1302.2190 1313.8883 1345.3046 1356.7361 1391.1652 1395.1888 1421.0463 1433.0034 1448.7635 1450.0211 1466.0814 1467.8280 1470.4480 1470.8347 1478.0988 1480.7089 1488.3613 1490.9569 1536.8552 1592.9090 1607.5430 1622.1640 1662.5363 2954.5683 2962.6250 2970.9395 2972.9212 2979.4998 2986.6856 2996.5234 3024.4853 3035.7941 3051.3158 3062.2819 3069.7888 3073.2700 3129.4494 3134.4582 3152.6165 3168.5023 3192.1117 3228.4029 3538.9753
redmass: 3.1128 2.7676 2.7862 6.1431 4.1635 3.6514 3.0275 2.6754 3.0336 2.7522 4.9980 4.8339 2.3904 3.9874 1.1206 1.8213 4.3329 3.0362 4.9615 4.1364 4.2019 5.4924 3.6068 3.3784 5.7719 5.3235 3.8669 4.9665 4.2071 1.7492 3.9854 3.7319 1.1155 3.5142 3.2747 1.2864 1.2538 4.9606 1.2989 5.2363 1.4007 1.9663 1.2483 2.3752 1.4241 1.5897 3.7798 1.3006 8.6457 4.2429 2.0637 3.0806 2.3141 1.4817 2.2670 1.7536 1.3169 1.4093 1.1550 1.9220 2.0510 1.9419 2.3888 1.3192 1.5922 1.5911 1.0529 1.1725 1.7274 1.3538 1.4418 1.6181 1.2152 7.5737 2.1749 1.4492 1.1107 1.9937 1.0678 1.0554 1.1627 1.0734 1.0422 1.0699 1.0894 2.0164 2.3928 6.2563 6.6585 3.8191 5.4813 1.0588 1.0328 1.0579 1.0377 1.0609 1.0632 1.0950 1.1008 1.1013 1.1041 1.1035 1.1011 1.0992 1.0994 1.0859 1.0915 1.0974 1.0953 1.0815 1.0774
irintensity: 0.1196 0.6719 0.1330 0.0936 4.4153 3.7169 0.5128 0.8638 2.8924 3.4496 7.2730 4.5164 0.6036 0.2066 0.0090 2.5026 15.1010 0.6738 2.8929 0.2995 3.4010 7.0202 2.3161 6.9641 0.8516 40.9885 0.2758 5.5118 4.1549 35.9487 7.0395 15.1996 7.0049 13.5335 27.0259 115.4897 4.4110 2.3291 3.4862 0.2602 1.4391 3.3999 15.7295 32.7880 70.7144 5.1444 4.0316 4.3626 49.2105 0.8024 21.4008 4.2755 1.1357 6.2585 36.5880 35.1274 5.6791 2.7650 6.2378 0.0846 80.1182 23.3039 278.2649 41.0553 56.0220 18.8858 0.6165 2.9857 22.9424 18.5012 5.8155 2.8101 9.3314 23.8015 275.8071 69.0003 15.3425 24.7983 0.4903 17.1315 76.0337 0.7279 12.6594 7.1583 23.1409 41.8802 794.4495 31.3289 56.5012 62.0360 326.5164 14.3088 68.0214 47.3183 33.3106 3.9676 53.6552 8.1273 20.7999 0.6089 45.9053 18.3064 115.9948 50.5030 15.6384 1.3907 23.9789 21.1272 6.7775 256.5600 37.6241
temp: 298.150 k
press: 1.00000 atm
elementType: 8 8 8 7 7 6 6 6 6 6 6 6 6 6 6 6 6 6 6 1 1 1 1 1 1 1 1 1 1 1 1 1 1 1 1 1 1 1 1
symmnumber: 1
zpe: 846921.0 jmol-1
zpe.correction: 0.322575 hartree
zpe.thermalcorrener: 0.341775 hartree
zpe.thermalcorrenthalpy: 0.342719 hartree
zpe.thermalcorrgfe: 0.273269 hartree
zpe.sumelectzpe: -879.256457 hartree
zpe.sumelectthermal: -879.237258 hartree
zpe.sumelectthermalent: -879.236313 hartree
zpe.sumelectthermalfe: -879.305763 hartree
dipole: 2.3522 2.3922 -0.3282
dipole: 3.3709
quadrupole: -96.0623 -108.9676 -116.4526
quadrupole: -16.2268 -1.5188 0.7774
quadrupole: 11.0985 -1.8068 -9.2917 -16.2268 -1.5188 0.7774
hfenergy: -879.5790322 hartree
pointgroup: C01 [X(C14H20N2O3)]
dipole: 0.8715065 -0.8314072 -0.5550734 debye
polarizability: 264.03132|-17.6280977|156.1193901|14.1047405|41.5846359|140.1506127 unknown
InChI: InChI=1S/C14H20N2O3/c1-3-4-5-10-13(17)16-14(18)15-11-8-6-7-9-12(11)19-2/h6-9,15-16H,3-5,10H2,1-2H3
charge 0 multiplicity 1
39 atoms
O  1.140705 -1.122554 0.091111
O  -2.120641 -1.552984 -1.060625
O  -0.836531 2.056987 2.078831
N  0.981973 0.73071 1.504548
N  -1.14913 0.245541 0.580969
C  5.553172 -0.617627 0.253156
C  4.058437 -0.390695 -0.061623
C  6.437149 -0.624663 -1.015098
C  3.182022 -0.367209 1.216941
C  7.931327 -0.857368 -0.703514
C  1.694955 -0.296577 0.88431
C  -2.536662 0.350105 0.306102
C  -0.420507 1.066119 1.409167
C  -3.07019 -0.629875 -0.59008
C  -3.400725 1.333441 0.843503
C  -4.4359 -0.6233 -0.936362
C  -4.770709 1.33634 0.49222
C  -5.288981 0.366484 -0.390882
C  -2.565579 -2.585522 -1.995066
H  5.673967 -1.582883 0.788324
H  5.91587 0.170908 0.945776
H  3.683923 -1.192076 -0.725784
H  3.934472 0.563976 -0.611385
H  6.074774 -1.412565 -1.706136
H  6.314417 0.338786 -1.550311
H  3.486852 0.467593 1.877361
H  3.3505 -1.307097 1.778819
H  8.327303 -0.064844 -0.040575
H  8.083417 -1.827591 -0.193852
H  8.540667 -0.86144 -1.625786
H  1.479396 1.369824 2.129984
H  -0.628034 -0.52431 0.11241
H  -2.98971 2.079574 1.526121
H  -4.839671 -1.375334 -1.620835
H  -5.429049 2.102629 0.914725
H  -6.350645 0.372177 -0.659928
H  -3.32852 -3.24081 -1.531861
H  -2.97266 -2.135961 -2.921428
H  -1.663451 -3.169511 -2.227846
