program: Gaussian 09
title: 000237537
version: EM64L-G09RevD.01
frameworkgroup: C1[X(C12H8ClNO2)]
method: RPBEPBE
basis: SDD
operation: Freq
keyword: #p
keyword: freq=noraman
keyword: PBEPBE/SDD
title: #p freq=noraman PBEPBE/SDD
converged: YES YES NO NO
title: Mulliken charges:
elementType: Cl O O N C C C C C C C C C C C C H H H H H H H H
charge: -0.060588 -0.193411 -0.194793 -0.222864 0.178722 0.177166 0.108448 0.113155 -0.456677 -0.348807 -0.349915 -0.209966 -0.209552 0.127805 0.083037 -0.682731 0.270278 0.269120 0.271355 0.270493 0.240924 0.240604 0.288186 0.290010
chargesum: 0.00000
title: Mulliken charges with hydrogens summed into heavy atoms:
elementType: Cl O O N C C C C C C C C C C C C
charge: -0.060588 -0.193411 -0.194793 -0.222864 0.178722 0.177166 0.108448 0.113155 0.082721 -0.077452 -0.079421 0.030958 0.031052 0.127805 0.083037 -0.104535
polarizability: 2.00048844e+02 1.73246942e+00 1.49913745e+02 1.72831480e+01 -7.98669974e+00 1.02068502e+02
1716.lowfreq: -0.0026 -0.0020 -0.0015 3.2307 4.8059 6.9543 10.9752 18.7903 39.0925
frequency: 10.7277 18.7499 39.0792 83.7092 110.3718 138.2976 165.2883 207.2757 215.9585 243.7340 256.6290 308.6991 329.9183 388.2616 409.9408 430.2564 455.4108 522.7750 550.8678 607.7716 627.9089 659.1575 677.5864 697.0819 715.5501 776.6747 785.7512 799.9763 825.6283 894.0323 907.4633 925.3547 946.0655 975.7560 1007.7549 1015.5097 1071.4116 1091.4335 1144.1394 1166.7329 1171.5058 1183.8321 1206.7219 1246.2736 1283.7923 1304.5975 1322.2651 1364.6789 1416.0980 1430.3195 1439.2694 1454.1340 1454.4488 1614.0567 1618.6468 1634.5320 1680.8859 2282.8988 3001.7610 3053.0243 3057.1974 3125.0305 3140.8835 3154.3119 3165.8949 3175.6560
redmass: 8.0984 8.0868 4.0536 10.2625 5.7560 4.9993 8.1040 4.8296 3.2758 7.7982 3.2377 5.7674 7.6027 6.3901 3.2747 8.4579 4.8587 7.2126 8.8376 9.3305 7.4443 4.8173 6.3441 5.2004 3.4655 3.0882 5.3075 2.0023 3.9545 1.4880 1.3950 3.2384 7.0037 1.4129 1.3491 2.0332 2.6172 2.9147 1.0936 1.3456 1.9977 2.7106 3.1074 1.2259 1.4796 1.4184 2.9035 1.7088 5.9065 1.1149 1.1134 2.5041 2.7088 7.6648 7.7571 12.1864 12.0509 11.7229 1.0581 1.0562 1.1020 1.1093 1.0865 1.0907 1.0957 1.1004
irintensity: 1.6350 0.2558 4.0636 0.1248 7.1466 0.0057 4.4891 4.0687 3.1406 0.9982 5.7352 6.2464 16.6431 0.7328 4.8006 20.9022 0.0533 8.2683 4.5927 31.3703 62.0162 0.0020 0.4933 16.0330 69.0910 13.6812 0.0118 26.2273 0.7055 1.1400 0.0483 59.3079 7.9415 2.0781 0.0007 0.9411 23.0442 28.3062 0.4575 13.9517 4.8742 23.8237 10.4548 70.0176 0.4709 79.0422 303.3963 78.1716 4.8001 60.9920 5.9336 11.1357 2.1529 1.7194 54.5129 404.9413 49.5615 15.6301 10.9275 11.2999 1.7080 2.0572 1.6760 4.7956 5.1151 19.8008
temp: 298.150 k
press: 1.00000 atm
elementType: 17 8 8 7 6 6 6 6 6 6 6 6 6 6 6 6 1 1 1 1 1 1 1 1
symmnumber: 1
zpe: 443739.2 jmol-1
zpe.correction: 0.169011 hartree
zpe.thermalcorrener: 0.183346 hartree
zpe.thermalcorrenthalpy: 0.184290 hartree
zpe.thermalcorrgfe: 0.123795 hartree
zpe.sumelectzpe: -1126.191733 hartree
zpe.sumelectthermal: -1126.177399 hartree
zpe.sumelectthermalent: -1126.176454 hartree
zpe.sumelectthermalfe: -1126.236949 hartree
dipole: -4.0626 1.3748 -1.1078
dipole: 4.4297
quadrupole: -86.0916 -106.4517 -93.6078
quadrupole: 12.0706 7.9502 0.9450
quadrupole: 9.2921 -11.0680 1.7759 12.0706 7.9502 0.9450
hfenergy: -1126.3607443 hartree
pointgroup: C01 [X(C12H8Cl1N1O2)]
dipole: 1.577506 0.5662654 0.4775294 debye
dipolederiv: -0.4916832 -0.1764385 0.1227559 -0.4652799 -0.4675772 0.1657112 0.0340542 -0.0058658 -0.189672 -0.576614 -0.158014 -0.1787607 0.016931 -0.8045437 -0.3280771 -0.1462558 -0.3290392 -0.583226 -0.5933788 0.2490431 0.0107808 0.1262118 -0.9759724 -0.1542514 -0.0822041 -0.1465635 -0.3862946 -1.1288767 0.0922301 -0.1199096 0.168857 -1.0394563 -0.3240532 -0.3634424 -0.3070701 -0.5306251 -0.3953819 -0.0852727 -0.1881421 -0.0690544 -0.0174464 -0.0669327 -0.244018 -0.0633653 -0.1389012 -0.3980861 0.1940087 -0.060215 0.22136 -0.1389336 0.0537458 -0.1152256 0.0519754 -0.0083555 1.1415723 -0.1698464 0.2806313 -0.4338057 1.2638321 0.5006986 0.300344 0.4085415 0.6284189 1.1413256 -0.1172614 0.2943517 0.0195229 1.3237087 0.3394298 0.492781 0.4229206 0.5516698 1.0611357 0.0002225 -0.0574544 -0.0169657 0.1769998 -0.0900692 0.1741898 -0.077316 0.2823522 -0.0986315 0.066617 0.0231741 -0.0975594 0.0947513 0.0577724 -0.0530698 0.1234926 -0.0558944 -0.1039978 -0.0682207 -0.0406197 0.0954647 0.097829 0.120966 0.0360293 0.0552129 -0.0621458 0.074964 -0.1364433 0.0642681 -0.1029126 -0.0237709 0.0032832 0.0695163 -0.0211962 -0.1021152 0.0701404 0.0455892 0.1465619 0.0182075 -0.0747879 0.0294048 0.1243509 0.0548291 -0.0436632 -0.1316021 0.0500919 -0.1022462 0.0259314 -0.0752547 0.0444676 -0.1416601 0.0071389 -0.091779 -0.4484422 -0.1112079 0.0972892 -0.019759 -0.2020368 -0.0490088 0.2807771 0.0555221 -0.2234672 0.8055958 0.3339433 -0.212924 0.5847697 0.6699555 -0.1608833 -0.1970504 -0.0577871 0.3091663 -0.0042652 -0.0019481 0.0720487 -0.0754742 0.093219 -0.0894134 0.0002329 -0.0250901 0.0456469 -0.0633465 -0.041101 0.0455819 0.0280781 -0.0020129 0.1008814 0.0208422 0.0274894 0.0935908 0.1154986 -0.0065696 -0.0297287 0.0282631 0.0081811 -0.0567427 -0.0093052 -0.0743279 0.1157979 0.1155136 0.0313929 -0.0120486 -0.0069339 0.0040064 -0.0726557 -0.0264098 -0.0551246 0.1174539 -0.027881 0.0960288 -0.0504527 0.1034956 0.0397126 -0.0004988 -0.0527933 -0.0026273 0.129984 -0.0231916 -0.0278094 -0.105896 -0.031213 0.0877035 -0.0502463 -0.1133586 -0.0482683 0.0764284 -0.0613099 0.009509 0.0304653 -0.0110041 -0.0588348 0.0200236 0.0030547 0.0206563 0.1075257 0.0209426 -0.0685437 -0.0295111 -0.1071311 0.0207287 0.0064485 0.0086207 -0.0141375 -0.0418959 unknown
polarizability: 201.540213|-0.0876897|144.2661474|11.6054682|18.143606|106.2247314 unknown
InChI: InChI=1S/C12H8ClNO2/c13-7-3-4-8-14-11(15)9-5-1-2-6-10(9)12(14)16/h1-2,5-6H,7-8H2
charge 0 multiplicity 1
24 atoms
Cl -5.60227 -1.62076 0.985046
O  0.093048 -1.829075 -1.800595
O  0.002304 2.451839 0.16285
N  -0.268514 0.360565 -0.939576
C  1.731303 -0.658985 -0.326404
C  1.704725 0.629546 0.262666
C  0.470272 -0.851483 -1.111305
C  0.424206 1.305797 -0.124022
C  -1.601623 0.591713 -1.519785
C  2.817295 -1.527258 -0.140879
C  2.764509 1.092359 1.056652
C  3.893158 -1.069425 0.663792
C  3.8672 0.22028 1.253008
C  -2.706731 0.398101 -0.56302
C  -3.650645 0.245958 0.21648
C  -4.746882 0.086555 1.151969
H  -1.710329 -0.117515 -2.362123
H  -1.631818 1.621306 -1.921591
H  2.826548 -2.519722 -0.601965
H  2.734693 2.090064 1.505496
H  4.757473 -1.720149 0.833696
H  4.712197 0.546215 1.868796
H  -5.555289 0.813584 0.982414
H  -4.41093 0.122489 2.1993
