program: Gaussian 09
title: 000237541
version: EM64L-G09RevD.01
frameworkgroup: C1[X(C16H16N4)]
method: RPBEPBE
basis: SDD
operation: Freq
keyword: #pfreq=noraman
keyword: PBEPBE/SDD
title: #p freq=noraman PBEPBE/SDD
converged: YES YES NO NO
title: Mulliken charges:
elementType: N N N N C C C C C C C C C C C C C C C C H H H H H H H H H H H H H H H H
charge: -0.106927 -0.214209 -0.059090 -0.107254 -0.393045 -0.478202 -0.536034 0.271185 0.269009 -0.364139 -0.378062 -0.388875 0.319661 -0.248121 -0.242691 -0.047188 -0.303691 -0.277980 -0.202375 -0.218977 0.206047 0.242819 0.232777 0.203674 0.217274 0.238991 0.237366 0.230262 0.230416 0.233988 0.228481 0.228305 0.264189 0.253899 0.227783 0.230736
chargesum: 0.00000
title: Mulliken charges with hydrogens summed into heavy atoms:
elementType: N N N N C C C C C C C C C C C C C C C C
charge: -0.106927 -0.214209 -0.059090 -0.107254 0.055821 -0.041751 -0.079769 0.271185 0.269009 0.103489 -0.147646 -0.154888 0.319661 -0.019640 -0.014387 -0.047188 -0.039502 -0.024081 0.025408 0.011759
polarizability: 2.41589275e+02 6.05926471e+00 1.79963042e+02 -2.40663936e+01 1.57688392e+00 1.50427542e+02
1716.lowfreq: -9.2137 -3.6403 0.0005 0.0007 0.0010 4.5331 20.3360 29.0862 41.0526
frequency: 19.7703 28.9696 40.9841 83.2669 118.9826 151.8808 179.5401 215.1783 219.1616 256.2146 274.9477 296.6445 327.2406 362.5371 427.7857 430.1006 443.6714 460.3568 487.9917 506.1692 524.1111 569.5500 580.4175 615.8802 628.4014 641.0817 711.9886 726.3699 745.2888 749.5382 756.1130 765.8147 781.5316 789.7690 840.7814 861.8953 868.9097 888.2371 901.2627 927.5570 941.5844 949.6154 984.6031 986.4485 991.4456 1001.9693 1007.6273 1033.4016 1045.7616 1077.2835 1084.3859 1097.2242 1127.2467 1136.9083 1160.7384 1166.8112 1174.6188 1194.1019 1200.4864 1206.9609 1216.1703 1226.5415 1235.2517 1268.8778 1281.3457 1288.4839 1301.0217 1332.9289 1345.8250 1364.6279 1379.8777 1387.7205 1403.9088 1413.3469 1442.4564 1444.8213 1447.9429 1460.1068 1470.8575 1478.5806 1483.7672 1491.6848 1587.2940 1594.9414 1617.2968 1622.6292 2821.1389 2875.8061 2918.8542 2982.5805 2996.9013 3013.1938 3038.3804 3058.0568 3110.6227 3116.8556 3136.1116 3137.7076 3153.6540 3159.9904 3174.9253 3182.1147
redmass: 5.3815 4.4131 4.9054 4.0145 3.3217 3.6156 3.3349 5.7159 5.7850 2.4804 2.1951 6.6465 2.1803 4.4104 2.9437 2.6148 4.2184 3.7554 5.1295 3.7793 6.6434 3.9616 4.1706 6.3357 5.8250 3.9538 3.4495 4.3440 4.5007 1.3139 3.6965 1.4724 5.3979 2.3997 3.7414 1.4248 1.3219 4.8726 6.1739 2.4407 1.3819 1.3691 1.3114 1.3237 1.7507 2.1066 2.4254 2.4106 2.0676 2.2201 4.0411 2.5694 1.6336 1.8033 1.4372 1.9428 1.1080 1.2030 2.1553 3.0727 2.9784 2.3773 1.4719 1.4752 1.4893 1.3839 1.4331 1.6565 1.5494 2.1297 2.0102 3.2464 1.6813 2.6142 2.2947 4.0969 1.1447 1.1447 1.3306 1.2230 1.8074 2.3304 7.2116 6.7788 6.4750 7.6443 1.0710 1.0712 1.0653 1.0608 1.0859 1.0943 1.0996 1.0902 1.0873 1.0887 1.0864 1.0927 1.0910 1.1005 1.0962 1.0983
irintensity: 1.6923 1.3142 1.2816 2.1950 1.6250 1.2115 0.4480 0.7099 0.2907 7.0867 6.8031 0.6121 7.7385 0.8484 6.1044 6.5207 2.5684 0.5272 1.0782 0.7291 0.2909 2.2879 0.7502 2.7240 1.6930 4.8997 0.2326 1.3865 9.3063 77.0877 11.5351 77.5369 37.1199 3.0128 2.5350 0.2605 0.4872 33.8558 83.6221 19.7311 0.8672 1.9418 0.2095 0.1298 3.1804 8.4014 18.0864 5.0776 0.7040 18.3460 1.5412 56.3291 5.9230 67.3198 7.9250 15.3213 1.3454 10.3568 2.5919 22.4674 12.2155 3.3584 4.7634 5.3832 5.5117 3.6826 24.3835 53.0029 5.1863 35.2430 1.1519 6.8626 5.1375 16.1280 4.7422 7.3337 14.3483 2.8944 4.9514 17.0714 19.3550 20.7435 4.8669 4.2128 0.6723 12.2740 84.3333 83.0219 67.1472 21.6768 22.8353 20.9410 28.3628 27.7434 14.0712 3.1896 4.1048 27.2501 14.0514 34.0899 15.4547 8.6053
temp: 298.150 k
press: 1.00000 atm
elementType: 7 7 7 7 6 6 6 6 6 6 6 6 6 6 6 6 6 6 6 6 1 1 1 1 1 1 1 1 1 1 1 1 1 1 1 1
symmnumber: 1
zpe: 761066.1 jmol-1
zpe.correction: 0.289875 hartree
zpe.thermalcorrener: 0.305609 hartree
zpe.thermalcorrenthalpy: 0.306553 hartree
zpe.thermalcorrgfe: 0.244980 hartree
zpe.sumelectzpe: -836.857352 hartree
zpe.sumelectthermal: -836.841618 hartree
zpe.sumelectthermalent: -836.840674 hartree
zpe.sumelectthermalfe: -836.902247 hartree
dipole: 3.3535 2.2419 -1.5664
dipole: 4.3273
quadrupole: -122.8567 -118.2491 -110.5232
quadrupole: -13.6434 1.5878 4.7208
quadrupole: -5.6470 -1.0394 6.6864 -13.6434 1.5878 4.7208
hfenergy: -837.1472267 hartree
pointgroup: C01 [X(C16H16N4)]
dipole: 1.0405015 1.1745218 -0.6605708 debye
polarizability: 224.479858|19.8997474|183.0999999|-37.9487593|-0.6749911|164.4000008 unknown
InChI: InChI=1S/C16H16N4/c1-2-6-14-11-19(10-9-13(14)5-1)12-20-16-8-4-3-7-15(16)17-18-20/h1-8H,9-12H2
charge 0 multiplicity 1
36 atoms
N  0.457841 -0.969463 -0.754103
N  -1.848003 -1.609583 -0.370194
N  -2.466085 -2.769381 0.191977
N  -3.528523 -2.368198 0.898049
C  1.071093 -1.474517 0.498694
C  1.462023 -0.711864 -1.809478
C  1.934084 -0.361521 1.117061
C  2.652995 0.089664 -1.293084
C  2.89394 0.239362 0.098776
C  -0.676399 -1.766669 -1.236293
C  3.550815 0.666902 -2.224898
C  4.033438 0.968547 0.524379
C  -2.542572 -0.469856 0.002394
C  4.679404 1.393801 -1.792145
C  4.922512 1.54555 -0.406347
C  -3.619463 -0.961348 0.811294
C  -2.368385 0.911444 -0.254457
C  -4.566247 -0.073784 1.378471
C  -3.319677 1.779079 0.312734
C  -4.40347 1.297535 1.115814
H  1.692078 -2.3846 0.305468
H  0.264378 -1.764053 1.193966
H  0.97156 -0.158928 -2.634571
H  1.849832 -1.668201 -2.251371
H  2.495761 -0.757537 1.984604
H  1.260602 0.429879 1.500415
H  -0.487675 -2.864513 -1.268822
H  -0.922937 -1.426532 -2.260611
H  3.361922 0.547664 -3.299699
H  4.221969 1.08088 1.599568
H  5.362037 1.837578 -2.52516
H  5.797579 2.105135 -0.057595
H  -1.524057 1.281366 -0.841361
H  -5.386307 -0.453817 1.994592
H  -3.226163 2.857651 0.143471
H  -5.113803 2.01803 1.534961
