program: Gaussian 09
title: 000237526
version: EM64L-G09RevD.01
frameworkgroup: C1[X(C8H13N3O)]
method: RPBEPBE
basis: SDD
operation: Freq
keyword: #p
keyword: freq=noraman
keyword: PBEPBE/SDD
title: #p freq=noraman PBEPBE/SDD
converged: YES YES NO NO
title: Mulliken charges:
elementType: O N N N C C C C C C C C H H H H H H H H H H H H H
charge: -0.450968 -0.117682 -0.011530 -0.011387 -0.367313 -0.377757 -0.371770 -0.313556 -0.415085 -0.418989 -0.152376 -0.153279 0.227843 0.234814 0.229064 0.237726 0.234048 0.228020 0.191873 0.202975 0.261769 0.247777 0.261379 0.252241 0.352164
chargesum: 0.00000
title: Mulliken charges with hydrogens summed into heavy atoms:
elementType: O N N N C C C C C C C C
charge: -0.098804 -0.117682 -0.011530 -0.011387 0.095344 0.089032 0.090298 0.081293 0.094460 0.094631 -0.152376 -0.153279
polarizability: 1.28705855e+02 -2.60459423e+00 1.07765678e+02 7.25785746e-02 -3.59067462e+00 7.79756009e+01
1716.lowfreq: -8.4987 -4.4069 -0.0009 -0.0008 -0.0005 7.1977 38.3066 40.0645 44.2671
frequency: 38.3043 40.0525 44.2594 64.9652 71.3284 81.6435 140.9347 144.4284 191.0756 244.1738 261.5763 278.0790 329.9223 361.3315 374.7208 381.4608 426.0423 466.6539 535.9252 548.4604 767.3092 771.8567 810.6229 843.5880 937.7745 937.9860 977.9561 995.6015 1011.6903 1025.4225 1040.1373 1044.7647 1069.7670 1132.5028 1147.4815 1190.0666 1208.6831 1233.3325 1245.5741 1275.5115 1279.7835 1287.5150 1303.1226 1307.8617 1353.3258 1365.9649 1376.0280 1415.0800 1446.4031 1447.3345 1473.1125 1481.3200 1483.5153 1488.7771 2198.9994 2199.2238 2915.6614 2920.8253 2937.5943 2943.0396 2999.0231 3002.0951 3004.0456 3042.2376 3048.9135 3056.8211 3068.2299 3070.2199 3582.3830
redmass: 8.6671 4.4071 5.6692 2.4675 2.5152 2.8425 4.7365 4.8393 2.7788 3.9799 1.0921 2.9252 3.6430 3.6733 3.5847 3.9539 3.9786 4.7673 4.4868 4.6091 1.1960 1.2369 1.1534 4.7514 4.5764 4.5431 5.8249 2.5460 2.8792 3.1504 2.1362 2.4929 1.8703 1.6865 1.4853 1.1319 1.2527 1.5189 1.5289 1.2751 1.2652 1.1555 1.2727 1.3320 1.3557 1.3070 1.3028 1.4499 1.0856 1.0819 1.0724 1.0938 1.0819 1.0826 12.4289 12.4309 1.0699 1.0700 1.0667 1.0592 1.1018 1.0597 1.0603 1.0909 1.0932 1.0959 1.1009 1.0999 1.0667
irintensity: 6.2438 1.5711 2.3511 6.4194 4.9351 9.3676 5.6065 5.0292 3.7864 8.4819 158.6685 2.3439 6.2810 5.8024 1.4545 6.4925 3.6685 7.1254 8.7373 4.4625 4.4802 8.5445 3.3664 12.5600 4.2572 7.4382 111.6475 13.5133 1.9373 5.7024 22.5580 10.5817 35.5656 28.5124 13.4783 2.2204 44.8768 10.2765 12.4191 2.5400 0.2955 1.4744 15.6771 25.9944 4.4084 12.8470 7.2296 0.0234 13.6430 4.7883 4.6848 12.9940 9.9043 6.7764 17.8067 9.1047 23.8999 70.1457 25.0064 103.8689 44.4646 10.3973 13.0166 5.5659 6.3472 41.9498 22.3661 28.9048 6.4405
temp: 298.150 k
press: 1.00000 atm
elementType: 8 7 7 7 6 6 6 6 6 6 6 6 1 1 1 1 1 1 1 1 1 1 1 1 1
symmnumber: 1
zpe: 533483.2 jmol-1
zpe.correction: 0.203193 hartree
zpe.thermalcorrener: 0.217451 hartree
zpe.thermalcorrenthalpy: 0.218395 hartree
zpe.thermalcorrgfe: 0.159666 hartree
zpe.sumelectzpe: -551.124029 hartree
zpe.sumelectthermal: -551.109770 hartree
zpe.sumelectthermalent: -551.108826 hartree
zpe.sumelectthermalfe: -551.167556 hartree
dipole: -0.2797 3.9051 -2.0508
dipole: 4.4197
quadrupole: -113.8173 -80.3435 -68.8490
quadrupole: -1.3816 0.3591 -5.1925
quadrupole: -26.1474 7.3264 18.8209 -1.3816 0.3591 -5.1925
hfenergy: -551.3272217 hartree
pointgroup: C01 [X(C8H13N3O1)]
dipole: -0.206834 -1.5574122 0.7451305 debye
dipolederiv: -0.4976577 0.0687289 -0.1603026 0.0466443 -0.9333365 -0.1221653 -0.164319 -0.1703394 -0.2591087 -0.8354402 0.0825772 0.0002938 -0.0518266 -0.7121408 -0.0059537 -0.0042887 -0.0025488 -0.4758196 -0.3408222 0.0785324 0.0305047 0.0240284 -0.2481355 -0.0102675 -0.0462314 0.0328988 -0.2207271 -0.3213904 -0.0266441 -0.0235268 -0.1010857 -0.2631966 -0.0215345 0.0470276 0.0154631 -0.2220636 0.0553761 -0.0092477 0.0716404 -0.0302196 0.5615761 0.1113735 0.0633453 0.0646255 0.2707699 0.5740021 -0.2835682 -0.0021053 -0.3924088 0.3200032 -0.0804175 -0.1627071 0.0183802 0.342532 0.6898281 0.263929 -0.0587253 0.2186658 0.1959896 0.0245812 0.1012154 0.1005562 0.3498076 0.3823199 -0.0785818 0.0668227 -0.0385125 0.7364519 0.0951772 0.0843132 0.1191252 0.2232073 -0.011335 0.1298389 -0.0069058 0.1922533 0.0894301 -0.0256182 0.0362029 -0.0827406 0.1000388 -0.0829977 -0.135027 -0.0252281 -0.0823599 0.1510872 0.0270414 -0.0883461 0.0198081 0.1109701 0.2075636 -0.1347557 0.0324519 -0.0601077 -0.0447323 -0.0326861 0.1389364 -0.0901687 -0.0731946 0.102695 0.1212991 -0.0403881 0.2105473 0.0562985 -0.0063966 -0.1366239 -0.0563929 -0.0731386 -0.1502059 0.0344435 0.0358902 0.0430609 0.0487276 -0.0004309 0.0252811 0.0244134 0.0752485 0.0390017 -0.0692529 -0.1082412 -0.011803 -0.0307497 -0.014817 -0.0739419 -0.0786375 -0.151582 0.0033299 0.0430988 0.0305651 0.1138543 -0.0400279 0.1071107 -0.0333351 0.0911748 -0.1550659 -0.0365739 -0.0939617 -0.0068919 -0.0894969 -0.0420365 -0.0378744 0.014885 -0.0241119 0.0675112 -0.1030092 -0.0448527 0.0678439 0.0056514 0.0648277 -0.0571726 0.1001159 -0.0002265 -0.1650736 0.0340488 0.05491 -0.0215567 0.067337 -0.1287884 0.0065483 -0.0218168 -0.0187107 0.0667575 -0.2105975 0.0957201 0.0656319 0.0586797 -0.0424495 -0.0361739 0.0279906 -0.0452846 0.0363257 -0.0006962 0.0001861 -0.1196646 -0.0074217 -0.0289649 -0.0535595 -0.0882769 -0.0706667 -0.1559211 0.0577623 0.0191483 0.0077231 0.0027208 0.0672749 0.0868948 0.0132504 0.053125 -0.0184997 -0.0049127 -0.0653746 -0.0376515 -0.0753991 -0.0066415 -0.0229026 -0.0235901 0.0055402 0.1025254 0.0597663 -0.0136098 0.0679174 -0.0209977 0.0778499 -0.0412273 0.0357777 -0.0317996 -0.030487 0.0600956 0.0355248 0.0053657 0.0312792 -0.0620898 0.0265731 0.0230508 -0.0014467 0.106335 0.3298494 -0.0730612 0.1285373 -0.0530832 0.2137731 0.0838974 0.1320844 0.127964 0.1486525 unknown
polarizability: 128.9398429|1.3848764|107.7653001|0.2084391|-2.4097956|77.7419908 unknown
InChI: InChI=1S/C8H13N3O/c9-3-1-5-11(7-8-12)6-2-4-10/h12H,1-2,5-8H2
charge 0 multiplicity 1
25 atoms
O  -0.224025 -4.118465 -0.103954
N  -0.030932 -0.388443 -0.183036
N  -4.227092 2.194574 0.046559
N  4.339887 1.8763 0.106346
C  0.145498 -1.803397 -0.595512
C  -1.349652 0.18866 -0.517197
C  1.11944 0.489895 -0.476231
C  -0.42722 -2.77188 0.44965
C  -1.845172 1.140344 0.612732
C  2.231891 0.321918 0.601294
C  -3.159247 1.732162 0.311012
C  3.403661 1.173171 0.336859
H  1.2228 -2.020697 -0.709652
H  -0.326642 -2.019387 -1.579696
H  -1.341632 0.741401 -1.484496
H  -2.07846 -0.633364 -0.627551
H  1.554923 0.298617 -1.483634
H  0.782787 1.542195 -0.470951
H  -1.50703 -2.567116 0.616637
H  0.108069 -2.637587 1.412512
H  -1.902419 0.572234 1.559236
H  -1.114986 1.956667 0.770176
H  1.810782 0.566795 1.593598
H  2.559325 -0.734126 0.641952
H  -0.573657 -4.797273 0.525047
