program: Gaussian 09
title: 000237535
version: EM64L-G09RevD.01
frameworkgroup: C1[X(C12H17NO3S)]
method: RPBEPBE
basis: SDD
operation: Freq
keyword: #p
keyword: freq=noraman
keyword: PBEPBE/SDD
title: #p freq=noraman PBEPBE/SDD
converged: YES YES NO NO
title: Mulliken charges:
elementType: S O O O N C C C C C C C C C C C C H H H H H H H H H H H H H H H H H
charge: 0.888581 -0.561463 -0.556810 -0.247768 -0.444739 -0.591011 -0.295087 -0.342593 -0.075249 -0.252365 -0.240616 -0.684768 0.504563 -0.326785 -0.428332 0.220699 -0.796545 0.262228 0.260572 0.230766 0.234602 0.198672 0.198460 0.284312 0.290979 0.217430 0.219236 0.216548 0.319032 0.230472 0.314260 0.243296 0.273020 0.236404
chargesum: 0.00000
title: Mulliken charges with hydrogens summed into heavy atoms:
elementType: S O O O N C C C C C C C C C C C C
charge: 0.888581 -0.561463 -0.556810 -0.247768 -0.130478 -0.068212 0.170282 0.054539 -0.075249 0.031946 0.050363 -0.031554 0.504563 -0.007753 -0.197860 0.220699 -0.043825
polarizability: 2.76232692e+02 9.55824124e+00 1.38669105e+02 7.21208582e+00 -2.20526556e+01 1.37206623e+02
1716.lowfreq: -69.4732 -7.1444 -4.5898 -2.4020 -0.0010 0.0006 0.0011 13.3801 25.3572
frequency: -69.4580 12.7729 25.2557 36.3424 61.0672 68.5508 76.6480 95.0197 111.4496 123.9851 163.8316 174.9378 204.9278 218.1585 220.0039 239.5756 306.0865 318.0763 333.7924 372.2083 376.1498 408.9605 414.2545 480.7363 520.6832 556.4980 582.6940 598.1832 619.7547 647.6968 675.0731 726.2950 744.8138 781.9550 790.2007 816.9860 837.3869 869.6255 882.9702 892.4636 927.4911 935.8908 962.3280 982.8304 991.1760 998.0783 1026.7709 1032.7567 1054.8803 1061.0604 1070.5473 1100.0774 1117.8254 1180.8878 1199.9415 1216.4941 1218.9680 1261.7663 1273.5790 1292.5026 1293.3301 1304.3630 1345.2040 1368.3922 1377.9731 1390.8701 1403.2609 1403.4397 1446.8965 1467.7089 1472.3537 1475.1192 1475.6868 1477.7921 1489.4100 1503.6169 1596.0306 1600.4133 1640.5436 2972.2017 2979.2584 2988.9060 2995.6338 3018.2749 3035.0964 3058.8449 3074.0560 3078.5412 3079.5454 3121.5534 3127.2528 3138.4515 3151.7776 3157.0868 3197.2393 3521.3691
redmass: 1.0416 3.5924 4.0650 3.3889 2.0927 4.1695 4.7964 5.2076 2.4675 4.1187 6.1356 5.3022 6.5293 2.9787 1.6793 2.3083 6.4615 6.4515 4.9771 3.8565 5.1065 4.2873 2.9900 7.1101 2.8583 4.9784 3.0208 5.4780 6.9538 1.1902 6.1086 3.4463 1.0707 1.2350 13.1759 4.5399 1.4107 1.4349 1.9882 1.8512 4.6881 2.3882 1.3618 1.8683 3.5674 1.3333 3.7523 1.6702 2.2906 1.2693 2.6203 2.2159 1.3117 1.1286 1.5463 3.2383 1.2541 1.8916 1.2081 1.1790 1.2443 1.3093 1.4601 3.9759 1.2547 1.2047 1.1184 4.9167 1.1357 1.0485 1.0655 1.0424 2.2884 1.0643 1.0857 2.0463 6.4806 5.6998 5.2434 1.0586 1.0362 1.0385 1.0590 1.1013 1.0551 1.1039 1.0983 1.1011 1.0998 1.0897 1.1104 1.0979 1.0912 1.0953 1.0949 1.0764
irintensity: 0.1013 0.8944 0.7573 6.0546 1.7647 0.5163 5.5463 2.2467 1.1794 7.1484 0.4763 3.1928 6.5475 11.0669 2.1512 0.6044 0.9120 4.5603 24.1345 2.1279 0.6865 15.7028 0.1896 50.1995 49.9456 66.1710 0.1925 29.4910 4.8895 62.3720 4.1070 2.6027 8.9342 1.7195 78.9716 7.6762 31.9736 46.7593 21.4942 4.7659 12.5486 44.8092 1.9354 22.9892 5.0220 3.2901 1.1851 8.6432 43.6286 7.6642 3.1777 44.2010 10.5569 31.1135 0.5202 60.9578 4.1496 61.5387 0.3321 20.3696 26.9676 10.7246 14.0116 225.1745 77.8626 6.9428 5.6049 14.7108 47.5532 20.5945 2.7316 12.9075 52.1170 1.4312 19.7156 405.6134 96.6584 23.5947 121.8784 28.2987 36.9472 6.8074 17.4716 10.6337 14.9219 3.3131 13.2691 59.2950 46.1461 15.5963 6.5868 6.2805 1.5598 9.3798 8.2767 14.3313
temp: 298.150 k
press: 1.00000 atm
elementType: 16 8 8 8 7 6 6 6 6 6 6 6 6 6 6 6 6 1 1 1 1 1 1 1 1 1 1 1 1 1 1 1 1 1
symmnumber: 1
zpe: 708903.5 jmol-1
zpe.correction: 0.270007 hartree
zpe.thermalcorrener: 0.288569 hartree
zpe.thermalcorrenthalpy: 0.289514 hartree
zpe.thermalcorrgfe: 0.220064 hartree
zpe.sumelectzpe: -1144.526258 hartree
zpe.sumelectthermal: -1144.507696 hartree
zpe.sumelectthermalent: -1144.506752 hartree
zpe.sumelectthermalfe: -1144.576201 hartree
dipole: -3.6972 -1.7775 -6.3203
dipole: 7.5350
quadrupole: -85.0385 -119.6069 -114.0121
quadrupole: -22.5624 7.6070 -3.7235
quadrupole: 21.1807 -13.3877 -7.7930 -22.5624 7.6070 -3.7235
hfenergy: -1144.7962654 hartree
pointgroup: C01 [X(C12H17N1O3S1)]
dipole: 1.4465164 0.9745876 -2.3970717 debye
polarizability: 276.2503924|9.8546117|133.53289|-6.6528303|21.6120542|142.325137 unknown
InChI: InChI=1S/C12H17NO3S/c1-3-4-9-17(15,16)12-7-5-11(6-8-12)13-10(2)14/h5-8,13H,3-4,9H2,1-2H3
charge 0 multiplicity 1
34 atoms
S  -2.025678 -0.921536 0.467125
O  -2.439787 -2.296945 -0.32663
O  -2.268539 -0.738441 2.07817
O  4.624123 1.400231 1.031787
N  3.90612 -0.06598 -0.657773
C  -2.975102 0.535688 -0.407498
C  -4.464041 0.416534 -0.08611
C  -5.273769 1.565896 -0.740638
C  -0.1949 -0.606393 0.118618
C  0.535089 0.203788 1.002692
C  0.388502 -1.258008 -0.980789
C  -6.779041 1.461855 -0.412003
C  2.527665 -0.219492 -0.354256
C  1.910134 0.408841 0.764637
C  1.761047 -1.056238 -1.215474
C  4.87429 0.699407 0.011303
C  6.266458 0.601437 -0.610417
H  -2.732165 0.399783 -1.474249
H  -2.50367 1.444825 0.001574
H  -4.843794 -0.558456 -0.44757
H  -4.605625 0.439618 1.01149
H  -5.130107 1.543235 -1.839576
H  -4.883071 2.542017 -0.38903
H  0.046761 0.642859 1.879353
H  -0.212851 -1.924091 -1.60842
H  -6.949985 1.512168 0.679189
H  -7.34878 2.282986 -0.883474
H  -7.198414 0.505179 -0.774625
H  2.511339 1.03387 1.426461
H  2.242857 -1.556171 -2.065171
H  4.235817 -0.587261 -1.474214
H  6.659958 -0.430016 -0.544924
H  6.943199 1.270803 -0.060919
H  6.257563 0.899506 -1.675241
