program: Gaussian 09
title: 000237620
version: EM64L-G09RevD.01
frameworkgroup: C1[X(C20H30O5)]
method: RPBEPBE
basis: SDD
operation: Freq
keyword: #pfreq=noraman
keyword: PBEPBE/SDD
title: #p freq=noraman PBEPBE/SDD
converged: NO YES NO NO
title: Mulliken charges:
elementType: O O O O O C C C C C C C C C C C C C C C C C C C C H H H H H H H H H H H H H H H H H H H H H H H H H H H H H H
charge: -0.492349 -0.473602 -0.402420 -0.290308 -0.204694 0.315857 -0.147411 0.289940 0.198177 -0.109350 -0.170087 -0.501397 -0.476997 -0.432864 -0.449755 -0.848371 -0.534167 -0.762877 -0.791760 0.137094 -0.568807 0.447090 -0.408895 -0.372294 -0.174957 0.226641 0.257986 0.195862 0.261076 0.185076 0.204659 0.216524 0.222378 0.196464 0.196539 0.223421 0.231998 0.264279 0.201328 0.232150 0.200245 0.231909 0.240208 0.229468 0.232780 0.199427 0.232041 0.328279 0.221421 0.248090 0.374368 0.381750 0.257621 0.272217 0.259003
chargesum: 0.00000
title: Mulliken charges with hydrogens summed into heavy atoms:
elementType: O O O O O C C C C C C C C C C C C C C C C C C C C
charge: -0.164070 -0.099234 -0.020669 -0.290308 -0.204694 0.315857 0.079229 0.289940 0.198177 0.148635 0.025775 -0.055245 -0.055814 -0.014022 -0.029795 -0.150765 -0.101772 -0.061292 -0.127512 0.137094 -0.099297 0.447090 -0.151275 -0.100078 0.084046
polarizability: 2.64603108e+02 6.16205680e+00 2.20595975e+02 -9.19804495e-01 -5.69314806e+00 1.76519997e+02
1716.lowfreq: -13.9918 -5.2181 -0.0004 0.0002 0.0004 4.8010 15.6526 28.3840 35.1528
frequency: 15.4627 28.1011 34.2136 39.2537 78.8945 93.3961 97.6461 123.4011 155.8633 165.4681 178.5615 188.3458 206.5123 217.9022 241.5510 246.5690 257.7674 260.1593 264.5714 279.5208 284.1836 286.2760 309.2592 311.4186 321.3152 330.2106 346.7832 352.3974 356.1356 391.8130 400.6440 412.3917 457.0680 471.4820 482.4362 521.4469 535.8947 557.4889 587.7669 594.3193 607.5786 629.7225 633.7187 663.9609 691.7728 701.2338 716.0119 723.7947 731.3406 741.6813 756.2802 771.7877 778.6586 812.1499 848.6810 856.1546 857.0885 860.9304 875.9761 891.6703 909.4467 922.8002 926.4289 937.8604 960.2375 967.9550 985.0178 988.8282 1004.2787 1009.2256 1023.6475 1026.2275 1038.5681 1041.8593 1046.4593 1052.2578 1074.0321 1084.6833 1087.4947 1091.0522 1101.1837 1126.7610 1138.0577 1152.6244 1161.2502 1169.5074 1175.2159 1190.4879 1200.0418 1222.4194 1227.8665 1241.4234 1242.8097 1256.8757 1259.0387 1273.6951 1282.3348 1287.1350 1290.0249 1305.4399 1316.1064 1329.1046 1336.5174 1337.9639 1345.0907 1349.7614 1354.7827 1358.9470 1367.2852 1383.7469 1384.9827 1392.4800 1392.5916 1413.6040 1444.3809 1459.3498 1463.3024 1465.9494 1470.3418 1471.4329 1476.5553 1477.1623 1480.8606 1485.4765 1486.5643 1490.6432 1499.1648 1585.3393 1613.2993 2934.3777 2964.0251 2964.4601 2976.1989 2979.4860 2981.6029 2984.9754 2989.7663 2992.5080 2995.7744 3007.6356 3022.2716 3032.4668 3044.8831 3048.8063 3056.7800 3057.7681 3063.5890 3073.9239 3079.5401 3081.6839 3081.9182 3097.0588 3106.8009 3212.1168 3250.5583 3266.6448 3350.3082 3492.3812 3562.1689
redmass: 4.5690 4.8667 4.1211 6.5294 5.6969 3.2848 4.8592 3.4307 2.8968 2.4561 2.6379 2.1763 2.2496 2.5582 2.9914 2.9256 1.7447 1.5790 1.2839 2.1762 2.5781 3.2634 3.5287 2.6913 2.2441 3.0612 2.9450 2.8320 2.5168 3.0771 2.5235 3.5387 2.5142 4.0658 2.4762 3.6681 4.3816 3.6588 3.8737 2.2710 2.7177 2.0702 1.7984 3.2108 1.2210 3.4312 1.4044 2.3732 1.7944 3.2404 2.5247 2.0773 2.0766 2.1474 5.5009 1.5594 1.6712 1.7907 1.9062 2.4267 2.1146 2.4735 1.9623 2.2089 2.1775 2.5879 1.6912 3.1576 1.8507 2.4060 3.2631 2.5067 2.8166 1.9191 2.3381 2.2429 2.3858 2.3405 2.0820 1.7124 1.8210 2.4720 1.9548 1.9384 2.5591 1.4708 2.5881 1.4508 1.7126 1.2822 1.5383 1.5735 1.8027 1.4268 1.4842 1.4747 1.3308 1.6057 1.2494 1.3946 1.3337 1.4037 1.4523 1.4445 1.4253 1.4188 1.3507 1.3729 1.4571 1.2618 2.6099 1.2649 1.2165 1.4774 1.0919 1.0820 1.0738 1.0710 1.0616 1.0851 3.2767 1.1548 1.0644 1.0650 1.0625 1.0671 1.0636 6.0327 6.9521 1.0820 1.0434 1.0793 1.0656 1.0613 1.0597 1.0407 1.0568 1.0615 1.0434 1.0805 1.0605 1.1003 1.0911 1.0968 1.0981 1.0975 1.0992 1.0985 1.0975 1.1000 1.0983 1.1002 1.0998 1.0934 1.0988 1.1073 1.0665 1.0636 1.0655
irintensity: 0.1933 0.0074 0.2514 1.4360 1.0472 1.7481 2.2974 0.2086 0.2237 2.4711 1.0150 5.1375 0.4144 0.6158 2.0736 10.6365 1.0582 9.3197 80.2353 5.0623 0.2846 11.0139 7.5564 2.4527 1.1312 4.6144 0.2940 2.2964 1.6778 6.0846 2.6581 6.5585 3.6368 7.0913 3.8016 4.9474 25.6036 5.0199 13.2876 3.5917 13.9501 68.9008 38.8821 34.9154 95.8488 3.0994 4.5172 94.6635 51.6553 20.1190 8.8144 48.5405 18.4839 11.3784 31.4137 1.7004 17.4882 2.9158 5.3655 25.8045 15.1004 1.6798 1.2002 13.1563 14.7148 4.9951 11.9320 29.5387 8.8707 1.2967 20.3035 31.0100 116.1811 9.4834 48.2756 96.8547 26.1935 18.8311 15.8034 11.7182 14.7471 17.8283 24.5529 2.4720 1.7783 2.9487 6.1132 9.1066 2.9350 7.7104 7.2814 6.8665 7.5840 11.8913 36.0051 3.5091 14.0184 18.1564 0.1890 3.9445 11.3005 2.0586 1.1188 5.1859 8.1837 6.1805 12.8847 13.1335 6.4727 15.6638 12.7253 12.8264 18.1585 68.8049 9.1083 4.9014 11.9005 2.4305 15.8159 19.2604 14.9820 6.4687 9.8960 23.0593 17.4192 6.2362 4.1510 4.2360 169.4532 60.0971 26.2249 12.8525 14.6154 33.8453 10.2135 41.4548 23.4633 75.0011 37.0475 22.4062 17.6386 33.5950 19.0669 5.4352 39.4218 47.9255 22.4137 48.0005 85.9915 30.3510 0.1873 18.7016 11.8296 1.4240 0.5543 0.5443 292.2812 29.2164 3.2169
temp: 298.150 k
press: 1.00000 atm
elementType: 8 8 8 8 8 6 6 6 6 6 6 6 6 6 6 6 6 6 6 6 6 6 6 6 6 1 1 1 1 1 1 1 1 1 1 1 1 1 1 1 1 1 1 1 1 1 1 1 1 1 1 1 1 1 1
symmnumber: 1
zpe: 1227978.1 jmol-1
zpe.correction: 0.467712 hartree
zpe.thermalcorrener: 0.492677 hartree
zpe.thermalcorrenthalpy: 0.493621 hartree
zpe.thermalcorrgfe: 0.413636 hartree
zpe.sumelectzpe: -1154.270283 hartree
zpe.sumelectthermal: -1154.245319 hartree
zpe.sumelectthermalent: -1154.244374 hartree
zpe.sumelectthermalfe: -1154.324360 hartree
dipole: -1.9405 -1.4955 1.7376
dipole: 3.0036
quadrupole: -151.2062 -143.2980 -157.5310
quadrupole: 6.1009 1.0974 8.0858
quadrupole: -0.5278 7.3804 -6.8526 6.1009 1.0974 8.0858
hfenergy: -1154.7379955 hartree
pointgroup: C01 [X(C20H30O5)]
dipole: 0.7562531 0.5625883 0.7127468 debye
polarizability: 263.9693409|8.2846912|219.9665488|-1.0428399|9.1583466|177.78319 unknown
InChI: InChI=1S/C20H30O5/c1-13-11-15(21)16-18(2,17(22)23)7-4-8-19(16,3)20(13,24)9-5-14-6-10-25-12-14/h6,10,12-13,15-16,21-22,24H,4-5,7-9,11H2,1-3H3
charge 0 multiplicity 1
55 atoms
O  -0.132002 -1.195913 2.128245
O  1.870909 -1.535964 -1.988969
O  4.128718 2.411476 -0.939357
O  3.523288 0.58624 -2.176669
O  -6.457133 0.280488 -0.229072
C  0.649505 0.247741 0.335041
C  2.051986 -0.488406 0.355372
C  -0.471288 -0.833336 0.711377
C  3.322508 0.459544 0.316063
C  -0.385701 -2.136721 -0.154793
C  2.106213 -1.754332 -0.556465
C  0.653992 1.365808 1.434104
C  1.030657 -2.749712 -0.108337
C  3.185972 1.517366 1.448729
C  1.870133 2.310702 1.35531
C  0.334923 0.90989 -1.034478
C  -1.928694 -0.260157 0.74172
C  4.623511 -0.374963 0.594492
C  -1.409156 -3.222928 0.264529
C  3.609925 1.119766 -1.037584
C  -2.737945 -0.191887 -0.588791
C  -4.161905 0.258545 -0.353196
C  -4.599935 1.551731 0.155524
C  -5.316526 -0.475279 -0.570252
C  -5.980704 1.527113 0.214567
H  2.115671 -0.91117 1.381672
H  -0.583693 -1.854476 -1.206329
H  3.099733 -2.235778 -0.422146
H  0.634627 0.88227 2.42708
H  -0.271429 1.967379 1.347048
H  1.253213 -3.092425 0.920949
H  1.070974 -3.62896 -0.778198
H  4.055775 2.197036 1.433667
H  3.209555 0.968086 2.411915
H  1.819028 3.037541 2.189041
H  1.858255 2.907427 0.423033
H  1.159249 1.567026 -1.358641
H  0.185314 0.168353 -1.83445
H  -0.556675 1.556103 -0.948202
H  -1.91572 0.739033 1.212581
H  -2.515612 -0.89823 1.433986
H  4.478501 -0.970517 1.513751
H  4.873552 -1.06087 -0.231777
H  5.480839 0.30394 0.753882
H  -1.341306 -4.079292 -0.431092
H  -1.188581 -3.622829 1.275162
H  -2.455587 -2.871758 0.257474
H  -0.792858 -1.865938 2.436489
H  -2.749392 -1.183531 -1.07453
H  -2.24994 0.495165 -1.300616
H  2.513072 -0.83398 -2.30152
H  4.363819 2.727753 -1.855268
H  -3.962515 2.390108 0.433213
H  -5.513974 -1.476446 -0.943397
H  -6.742944 2.239464 0.516514
