program: Gaussian 09
title: 000237566
version: EM64L-G09RevD.01
frameworkgroup: C1[X(C20H22O3)]
method: RPBEPBE
basis: SDD
operation: Freq
keyword: #pfreq=noraman
keyword: PBEPBE/SDD
title: #p freq=noraman PBEPBE/SDD
converged: YES YES NO NO
title: Mulliken charges:
elementType: O O O C C C C C C C C C C C C C C C C C C C C H H H H H H H H H H H H H H H H H H H H H H
charge: -0.265801 -0.168493 -0.218394 -0.498214 0.507155 0.200519 -0.672758 0.488042 0.245543 -0.454285 -0.339687 0.436042 -0.424216 -0.361249 -0.387826 -0.374765 0.434849 -0.424406 -0.360164 -0.808537 -0.261070 -0.807903 -0.664474 0.271696 0.234012 0.246285 0.233363 0.264597 0.231475 0.230247 0.239264 0.246428 0.227800 0.226918 0.229507 0.223090 0.235666 0.224271 0.238933 0.229679 0.222104 0.230408 0.217130 0.252770 0.224450
chargesum: 0.00000
title: Mulliken charges with hydrogens summed into heavy atoms:
elementType: O O O C C C C C C C C C C C C C C C C C C C C
charge: -0.265801 -0.168493 -0.218394 -0.226518 0.507155 0.200519 -0.192461 0.488042 0.245543 -0.220922 -0.075090 0.436042 -0.192741 -0.131001 -0.148562 -0.128336 0.434849 -0.196606 -0.133247 -0.120275 0.202133 -0.125712 0.029876
polarizability: 2.51744059e+02 -2.58076326e+01 2.39306400e+02 2.59154308e+01 9.17672303e+00 1.72166316e+02
1716.lowfreq: -9.9598 -7.8134 -1.0078 -0.0006 0.0005 0.0006 6.3272 15.6280 20.3393
frequency: 4.5668 15.5043 20.3283 27.3897 35.4765 36.2290 45.6652 55.1454 63.1675 73.6240 85.1573 104.4202 136.3902 140.9924 185.7390 209.7596 228.3888 262.6479 271.4257 289.5754 316.9276 333.5642 342.2255 361.2779 369.5202 405.8090 405.9331 416.0149 457.2758 486.8013 492.4774 519.0448 571.8082 582.2826 634.1057 637.4860 668.1925 699.2902 725.6816 727.0128 740.1097 774.9084 793.8147 808.3215 816.7874 822.6665 828.9139 846.0031 850.1236 866.7602 900.7288 903.7187 940.1947 950.9385 957.7731 971.3609 976.4462 987.8363 988.5988 1013.5390 1014.3045 1017.4101 1047.4666 1047.7274 1054.3014 1094.6414 1103.6812 1121.4602 1126.3998 1157.9941 1162.4204 1193.4926 1194.8209 1202.8660 1208.0935 1222.5482 1222.6920 1229.5421 1277.6589 1281.4837 1288.9405 1317.9851 1321.7795 1355.9308 1376.6710 1378.5442 1390.5967 1397.1922 1397.9272 1408.2882 1410.0847 1447.3409 1457.8478 1464.3760 1469.8383 1470.9090 1475.6617 1475.7650 1485.5161 1506.4865 1506.9884 1582.8733 1585.8482 1618.9948 1622.5729 1630.9688 1655.4901 2975.5010 2977.0394 2989.1179 2992.6271 3018.0881 3032.3680 3053.7776 3055.9540 3071.9271 3082.3246 3084.4213 3087.5141 3094.2264 3110.2510 3114.6042 3118.0084 3120.3442 3124.9843 3137.3287 3137.7371 3150.9982 3164.4783
redmass: 4.6236 4.5603 3.5170 3.8608 1.0903 1.3353 2.3091 3.4845 3.5891 5.5083 5.1054 3.8612 4.7488 4.0976 4.8475 1.5340 4.0695 2.4309 4.1242 2.8525 3.3945 3.6524 4.8778 2.9556 2.5336 2.8287 2.8333 4.0054 3.7508 4.0947 2.9626 3.4884 3.8411 5.0808 6.7413 6.6992 4.6925 4.0789 3.2222 3.3956 3.5282 3.2607 1.9261 1.7151 2.9469 1.9193 2.1212 1.2537 1.2705 3.6625 3.8342 2.9237 2.0890 1.3534 1.6081 1.3860 1.3871 1.4426 1.4161 3.0540 2.9436 2.8649 1.5586 1.5519 2.5527 2.3364 2.7077 1.3576 1.3870 1.6655 1.1457 1.3015 1.1306 1.7298 2.9596 2.8032 3.1300 1.6948 1.1235 1.4954 1.8153 1.2994 1.3387 1.3035 5.0382 4.6965 1.2336 1.2658 1.2668 2.6291 2.6181 1.0950 1.0897 1.0452 1.0482 1.0463 1.1017 1.1016 1.0518 2.6087 2.6545 6.0284 6.0484 6.8834 6.3688 8.0100 9.9842 1.0371 1.0372 1.0627 1.0360 1.0826 1.0593 1.0976 1.0973 1.0975 1.0987 1.0990 1.0974 1.1031 1.0876 1.0873 1.0885 1.1065 1.0897 1.0960 1.0965 1.0962 1.0955
irintensity: 0.1514 1.0042 0.1504 1.0184 0.4926 0.3837 0.1309 0.7908 0.7265 2.0037 0.8005 1.1440 1.0729 1.5448 1.2546 4.9809 1.2821 0.9190 0.4408 3.6425 8.8602 0.7904 9.3051 0.3361 0.1063 0.0961 0.1210 3.5136 3.9837 0.4628 12.5021 25.7722 46.2664 2.8113 1.5561 0.1031 15.7125 0.3854 5.5928 7.5543 5.3277 13.0697 11.9355 2.7069 6.0518 26.6799 17.5269 0.7416 0.1857 7.5855 8.8208 3.9642 14.8256 0.2970 3.5432 0.3129 0.0782 4.8223 1.5105 38.1001 30.6979 50.1586 16.3721 4.9672 145.3077 124.2384 191.6725 16.7567 38.7043 16.9631 6.4415 14.4859 1.6096 9.6104 2.6285 1.3081 1.9884 55.6482 0.9490 12.0863 176.1954 5.9164 19.6609 3.6197 1.6112 1.3989 22.6747 10.0920 12.9165 1.4735 6.1596 16.4077 11.7462 12.6909 12.0473 12.9792 17.7750 10.1295 12.0658 33.1050 44.4281 2.9126 0.6764 28.2209 9.3600 97.9306 116.5759 40.0757 36.3569 14.3314 21.8537 5.3568 27.8339 21.7093 19.5587 10.7209 19.3869 19.5929 35.9842 1.9439 11.1485 9.0079 24.4125 32.1561 17.4541 18.2620 27.0403 5.4185 1.2407
temp: 298.150 k
press: 1.00000 atm
elementType: 8 8 8 6 6 6 6 6 6 6 6 6 6 6 6 6 6 6 6 6 6 6 6 1 1 1 1 1 1 1 1 1 1 1 1 1 1 1 1 1 1 1 1 1 1
symmnumber: 1
zpe: 959165.3 jmol-1
zpe.correction: 0.365327 hartree
zpe.thermalcorrener: 0.389125 hartree
zpe.thermalcorrenthalpy: 0.390070 hartree
zpe.thermalcorrgfe: 0.304882 hartree
zpe.sumelectzpe: -999.334253 hartree
zpe.sumelectthermal: -999.310454 hartree
zpe.sumelectthermalent: -999.309510 hartree
zpe.sumelectthermalfe: -999.394698 hartree
dipole: -0.3339 1.6384 2.3096
dipole: 2.8513
quadrupole: -117.4139 -126.8191 -134.6037
quadrupole: -6.9823 8.5733 -0.0165
quadrupole: 8.8650 -0.5402 -8.3248 -6.9823 8.5733 -0.0165
hfenergy: -999.6995798 hartree
pointgroup: C01 [X(C20H22O3)]
dipole: -0.3996126 -0.5584123 0.8870722 debye
polarizability: 217.8109501|1.4828885|269.9935313|-24.4071667|20.2998637|175.4122938 unknown
InChI: InChI=1S/C20H22O3/c1-4-23-20(22)19(17-11-7-15(3)8-12-17)18(21)13-16-9-5-14(2)6-10-16/h5-12,19H,4,13H2,1-3H3
charge 0 multiplicity 1
45 atoms
O  -1.114341 3.950442 0.660447
O  1.537156 2.208409 -0.324654
O  -1.580147 2.745368 -1.284077
C  -0.619217 1.618837 0.718145
C  -1.250441 0.268553 0.380987
C  0.927747 1.536176 0.539881
C  1.659352 0.576035 1.496381
C  2.450615 -0.504847 0.764586
C  -1.170319 2.785446 -0.10601
C  -1.910676 -0.48206 1.382628
C  -1.159656 -0.271162 -0.927946
C  -2.384034 -2.292509 -0.218593
C  -2.469629 -1.746071 1.086403
C  -1.720479 -1.53067 -1.217322
C  1.964723 -1.832874 0.700335
C  3.676451 -0.199792 0.119958
C  3.921439 -2.538582 -0.622635
C  2.692662 -2.834233 0.018453
C  4.397571 -1.201954 -0.561567
C  -2.991842 -3.644626 -0.549382
C  -1.53103 5.215817 -0.023479
C  4.710418 -3.612588 -1.352776
C  -3.044881 5.416795 0.086262
H  -0.798063 1.847771 1.785733
H  0.93605 0.117093 2.190769
H  2.348905 1.208879 2.090241
H  -1.999007 -0.075688 2.398376
H  -0.661297 0.30248 -1.715408
H  -2.98189 -2.309979 1.875322
H  -1.640999 -1.933306 -2.234568
H  1.00926 -2.085374 1.176619
H  4.056197 0.827546 0.143218
H  2.299362 -3.857568 -0.016391
H  5.344513 -0.945282 -1.053018
H  -2.250867 -4.313837 -1.024822
H  -3.37491 -4.149502 0.354062
H  -3.8350 -3.540052 -1.258473
H  -0.966841 5.995925 0.51197
H  -1.20531 5.163768 -1.076893
H  5.707016 -3.761236 -0.89535
H  4.184725 -4.582876 -1.33419
H  4.877415 -3.339173 -2.411604
H  -3.323664 6.391787 -0.355026
H  -3.584672 4.625093 -0.459565
H  -3.36867 5.410419 1.141474
