program: Gaussian 09
title: 000021258
version: EM64L-G09RevD.01
frameworkgroup: C1[X(C7H12O3)]
method: RPBEPBE
basis: SDD
operation: Freq
keyword: #pfreq=noraman
keyword: PBEPBE/SDD
title: #p freq=noraman PBEPBE/SDD
converged: NO YES NO NO
title: Mulliken charges:
elementType: O O O C C C C C C C H H H H H H H H H H H H
charge: -0.255014 -0.207609 -0.250642 -0.386604 -0.475606 -0.262891 0.220339 -0.763048 0.286275 -0.750671 0.235844 0.235461 0.229752 0.229131 0.222337 0.222339 0.235126 0.234633 0.259111 0.248623 0.248462 0.244649
chargesum: 0.00000
title: Mulliken charges with hydrogens summed into heavy atoms:
elementType: O O O C C C C C C C
charge: -0.255014 -0.207609 -0.250642 0.084701 -0.016722 0.181786 0.220339 -0.034177 0.286275 -0.008935
polarizability: 1.09833187e+02 -2.25109454e+00 8.54958220e+01 4.17726762e-02 -6.70203623e-03 5.96271224e+01
1716.lowfreq: -63.2414 -38.0905 -5.7746 -0.0007 -0.0001 0.0008 3.4874 6.4762 26.8232
frequency: -63.1143 -37.9775 26.7837 44.7735 70.6053 80.3734 103.1499 171.1667 188.2192 236.6816 319.4429 402.6845 459.3413 463.3977 565.4932 570.9887 618.2310 731.8424 804.7007 815.5270 848.6091 932.4302 948.9602 955.4120 1003.8142 1041.4045 1071.1289 1090.9501 1105.1973 1169.0939 1172.9586 1206.5793 1255.6579 1268.3695 1277.9200 1344.9583 1368.6120 1376.5154 1384.0629 1433.7677 1444.1552 1453.2381 1454.0579 1454.8923 1467.7764 1482.7059 1639.4614 1650.5705 2960.3776 2982.6924 2993.8356 3004.3088 3007.9503 3025.3149 3051.3068 3065.3423 3091.9295 3095.9257 3124.1993 3143.4705
redmass: 1.1668 1.0538 7.2573 2.8420 4.3651 2.5740 1.7540 6.9906 2.7861 3.9261 4.0114 3.3540 2.0368 3.1533 2.9920 4.6588 4.6481 1.1587 4.3341 1.2579 5.1259 2.1333 3.6457 1.2664 2.2796 1.6701 2.7951 3.0703 1.9425 1.2265 2.1519 3.5843 1.1993 1.5124 1.0808 1.5836 1.2541 1.3933 1.4330 1.0776 1.0893 1.0635 1.0471 1.0498 1.0817 1.0855 7.6366 9.1438 1.0597 1.0378 1.0574 1.0975 1.0367 1.0603 1.1061 1.0964 1.1047 1.0974 1.0997 1.1010
irintensity: 0.8923 1.9665 4.1409 3.4801 5.3881 0.1624 1.7168 0.0346 6.6660 0.4767 16.6150 17.9210 0.4561 2.6321 2.8061 1.4226 6.0913 6.3339 11.9460 0.0544 13.9076 18.1097 15.0444 4.6367 117.8372 9.8979 2.4209 7.3081 0.2085 1.3546 78.7345 350.8608 0.0841 75.1838 0.0970 33.0047 63.5326 27.5815 24.5636 5.8080 37.6269 28.5652 18.0801 22.5374 2.1454 17.2139 142.0608 157.8471 15.9528 7.0112 19.6822 9.5302 2.9123 13.5281 10.9712 12.4016 40.2354 9.9159 13.8654 10.9868
temp: 298.150 k
press: 1.00000 atm
elementType: 8 8 8 6 6 6 6 6 6 6 1 1 1 1 1 1 1 1 1 1 1 1
symmnumber: 1
zpe: 469673.7 jmol-1
zpe.correction: 0.178889 hartree
zpe.thermalcorrener: 0.189929 hartree
zpe.thermalcorrenthalpy: 0.190873 hartree
zpe.thermalcorrgfe: 0.139750 hartree
zpe.sumelectzpe: -498.818444 hartree
zpe.sumelectthermal: -498.807404 hartree
zpe.sumelectthermalent: -498.806460 hartree
zpe.sumelectthermalfe: -498.857584 hartree
dipole: 1.1382 -1.3872 0.0173
dipole: 1.7945
quadrupole: -58.2397 -67.8238 -57.6108
quadrupole: -19.8273 0.0171 -0.0017
quadrupole: 2.9851 -6.5990 3.6140 -19.8273 0.0171 -0.0017
hfenergy: -498.9973336 hartree
pointgroup: C01 [X(C7H12O3)]
dipole: 0.4347371 -0.5562703 0.0052419 debye
dipolederiv: -1.8003513 -0.0615291 -0.0028501 -0.0913964 -0.4973824 -0.0018042 -0.0014685 -0.0013059 -0.2815391 -0.6466751 -0.0212374 -0.0010422 -0.0523853 -0.8563916 -0.0007269 -0.0008589 0.0002384 -0.2783564 -0.7427453 0.0162154 -0.0005431 -0.4038373 -0.9008311 -0.0038253 -0.0041462 -0.0046459 -0.3117439 -0.065432 0.0085865 -0.0001709 0.0064609 0.0331761 -0.000309 0.0003169 0.0002223 0.1244616 -0.4188899 -0.1504185 -0.0024096 -0.340588 -0.1172489 -0.0025788 -0.0060876 -0.0033176 0.1673326 0.8476534 -0.0862966 -0.0000302 -0.2377824 0.2661444 -0.0010062 -0.0009811 -0.0009728 0.3693456 1.2070949 -0.0144443 0.0051145 0.0762967 0.9931503 0.0006844 0.0059783 0.0003482 0.0648263 -0.4372593 0.2253154 -0.002189 0.2281572 -0.2001621 0.002071 -0.0036137 0.0031891 0.0376151 1.8610524 0.0150576 0.0029713 0.5146272 1.19186 0.0068386 0.0063247 0.0066708 0.1899959 -0.2227824 0.1625186 0.0007251 0.2340935 -0.2605391 -0.0013279 0.0006085 -0.0011579 0.0292955 0.0745713 -0.0004949 0.0045708 0.0046664 0.0136544 0.0892358 0.0014845 0.0893562 -0.043667 0.0739856 -0.0003564 -0.0044901 0.0046316 0.0156395 -0.0887368 -0.0016002 -0.0889659 -0.0464985 0.0596722 -0.00149 0.017045 0.0541425 0.0135281 -0.0938762 0.0167966 -0.1223641 -0.0348973 0.059905 -0.0013337 -0.016901 0.0546652 0.009789 0.0952139 -0.0148424 0.1237315 -0.0322059 -0.0298371 0.0070074 0.0190526 0.0685635 -0.0152017 0.0819795 -0.0012157 0.0985534 -0.067067 -0.0296822 0.0073923 -0.0189258 0.068746 -0.0130387 -0.0811143 0.0021559 -0.0977932 -0.0692126 0.095343 -0.0052317 0.0484948 -0.0009702 0.0511169 0.097478 -0.002781 0.1152526 -0.0269287 0.0948484 -0.0071684 -0.049568 -0.0023134 0.0463388 -0.0995638 0.0025931 -0.1178744 -0.022771 -0.0789864 -0.0512636 0.0013515 -0.1056217 0.0355063 0.0012168 0.0020901 0.000348 0.1235485 0.0925744 -0.0052322 0.0525548 -0.002451 0.0640822 0.0837978 0.0134928 0.1046498 -0.0074308 0.0934604 -0.003626 -0.0517008 -0.001305 0.0667717 -0.0827764 -0.012577 -0.1036394 -0.0112349 -0.0875199 -0.0319704 -0.0010597 -0.0763998 0.0600379 -0.00087 -0.0016689 -0.0005232 0.1271321 unknown
polarizability: 109.7125921|-2.8259214|85.6159823|0.0890676|0.0848064|59.6275575 unknown
InChI: InChI=1S/C7H12O3/c1-6(8)4-3-5-10-7(2)9/h3-5H2,1-2H3
charge 0 multiplicity 1
22 atoms
O  -1.837278 0.479984 0.000911
O  3.20555 1.368774 0.002057
O  -3.349319 -1.29361 -0.014103
C  0.581761 0.298574 0.001623
C  1.806853 -0.635729 -0.003937
C  -0.717214 -0.506272 -0.004239
C  3.146748 0.11148 0.00275
C  4.404649 -0.751287 0.005526
C  -3.128979 -0.061211 -0.003673
C  -4.163826 1.042811 -0.000216
H  0.615387 0.965735 -0.877597
H  0.61462 0.95432 0.889455
H  1.79293 -1.303613 -0.89147
H  1.791061 -1.317829 0.872583
H  -0.817321 -1.154907 0.88659
H  -0.815844 -1.1441 -0.903004
H  4.426863 -1.400742 0.901304
H  4.41973 -1.41991 -0.876058
H  5.302158 -0.114211 -0.004185
H  -4.030567 1.69166 -0.88306
H  -4.038715 1.677866 0.893788
H  -5.172345 0.60562 -0.008146
