program: Gaussian 09
title: 000237553
version: EM64L-G09RevD.01
frameworkgroup: C1[X(C16H28Br2N2O2)]
method: RPBEPBE
basis: SDD
operation: Freq
keyword: #p
keyword: freq=noraman
keyword: PBEPBE/SDD
title: #p freq=noraman PBEPBE/SDD
converged: YES YES NO NO
title: Mulliken charges:
elementType: Br Br O O N N C C C C C C C C C C C C C C C C H H H H H H H H H H H H H H H H H H H H H H H H H H H H
charge: -0.009576 -0.018254 -0.271029 -0.269119 -0.123629 -0.125705 -0.382613 -0.373026 -0.382520 -0.391413 0.330846 0.331722 -0.638034 -0.636435 -0.313962 -0.323647 -0.368162 -0.364754 -0.350099 -0.350606 -0.696459 -0.695937 0.255454 0.242669 0.271663 0.247299 0.222896 0.272154 0.247116 0.235907 0.286651 0.294089 0.216319 0.250525 0.251218 0.217889 0.177308 0.234578 0.178918 0.233783 0.193542 0.208445 0.193932 0.207639 0.219241 0.207577 0.213985 0.219109 0.207888 0.214615
chargesum: 0.00000
title: Mulliken charges with hydrogens summed into heavy atoms:
elementType: Br Br O O N N C C C C C C C C C C C C C C C C
charge: -0.009576 -0.018254 -0.271029 -0.269119 -0.123629 -0.125705 0.115511 0.145936 0.112531 0.091609 0.330846 0.331722 -0.351383 -0.342346 0.152883 0.145459 0.043724 0.047947 0.051888 0.050964 -0.055656 -0.054325
polarizability: 2.88321042e+02 1.24168703e+00 2.24907039e+02 -1.33147956e+01 6.87963813e-01 1.93539046e+02
1716.lowfreq: -9.0315 0.0001 0.0006 0.0010 0.5647 5.0500 12.2331 20.3252 26.9522
frequency: 12.0363 20.3225 26.8865 36.7399 47.5627 55.2118 59.2146 60.8545 68.0968 76.4907 81.0108 98.1035 108.9978 126.9490 138.9089 146.6336 153.7188 196.7351 206.0933 209.6055 224.2903 226.8140 244.6372 246.5311 265.4734 308.9245 326.9663 346.3254 361.4668 393.5283 413.5855 422.4268 448.5485 490.9495 507.8400 528.8811 540.3564 559.1700 603.0056 627.0759 704.6271 709.3836 729.4793 730.4836 739.0365 739.3487 806.7333 810.6354 831.7605 883.1053 893.4683 894.8865 906.1478 937.8551 943.9657 974.4671 1000.5578 1006.6652 1017.2829 1032.4317 1043.4080 1057.4344 1060.4496 1069.1701 1070.5307 1089.4730 1103.0866 1104.1842 1119.4148 1123.7563 1147.7190 1152.5717 1154.9582 1199.3826 1205.3619 1211.0041 1219.8636 1220.4987 1235.7710 1262.0415 1263.8602 1271.6176 1275.0291 1279.7262 1292.3449 1293.3250 1318.1593 1320.5968 1330.2355 1336.2721 1342.6481 1345.8155 1347.2724 1348.0345 1354.4949 1356.0041 1389.5280 1389.6248 1411.3517 1416.5128 1447.3077 1448.0964 1456.0458 1461.6868 1462.9478 1466.3957 1467.3939 1471.3739 1474.6673 1475.3941 1477.0592 1477.3935 1486.2986 1486.5045 1574.3650 1576.5851 2960.3319 2961.4429 2972.5708 2972.7290 2973.7943 2973.8713 2978.8515 2981.3016 2991.4753 2995.1063 3009.3678 3010.8079 3016.8459 3017.1974 3042.4459 3042.6266 3056.9709 3059.4919 3070.5903 3070.6165 3074.0745 3074.1405 3087.5399 3088.9347 3093.5213 3095.0641 3111.4092 3115.7665
redmass: 5.0260 7.9170 6.3430 4.0201 5.2964 1.6188 2.1995 2.5149 5.4707 4.9403 4.3653 5.2044 4.1270 6.5871 2.4949 2.4637 6.0281 4.0936 4.8816 4.2633 1.2101 1.1600 3.3770 2.4657 2.4577 2.7475 6.0085 2.7679 3.5513 3.1157 2.3678 3.0601 2.6412 3.6665 4.8487 4.7095 4.7760 5.9824 4.8617 2.1091 1.9892 2.3108 5.7524 4.5148 1.2417 1.2050 1.4229 1.3806 1.6088 2.7571 1.8493 1.8656 2.9098 1.3645 1.3771 2.4508 3.1851 4.0159 3.1335 2.7389 1.7944 1.9989 1.9506 2.5471 2.3890 1.9550 1.6946 1.7744 1.6929 1.5875 1.5493 3.4888 1.6443 1.3429 1.5249 1.3911 2.1369 1.8232 1.7827 1.3093 1.3386 1.3850 1.2445 1.3063 1.0646 1.0634 1.3095 1.3067 1.3183 1.3082 1.3135 1.3353 1.5253 1.5296 1.4142 1.3317 1.2140 1.2143 2.5816 2.6470 1.0985 1.0973 1.0826 1.0964 1.0988 1.0704 1.0680 1.0974 1.0604 1.0627 1.0463 1.0505 1.0814 1.0797 7.6949 7.8902 1.0626 1.0623 1.0560 1.0537 1.0413 1.0434 1.0691 1.0692 1.0668 1.0675 1.0663 1.0677 1.0915 1.0898 1.0985 1.0984 1.0879 1.0875 1.1006 1.1006 1.0994 1.0995 1.1020 1.1020 1.0961 1.0966 1.0934 1.0929
irintensity: 0.0157 0.0714 0.1830 0.2186 0.7629 0.2053 0.3150 0.1052 4.6926 0.3637 1.0284 1.5115 1.1299 2.6779 0.1119 0.6319 5.7359 0.5632 2.3921 2.9250 0.2877 0.2205 1.1143 0.7196 2.7737 3.9498 1.2781 24.4400 5.8874 2.8246 3.9803 5.3097 1.2002 2.3440 33.0989 29.1918 13.3670 24.0591 17.6943 10.6889 3.4240 8.9665 4.9205 11.6088 13.4916 7.5169 0.8009 3.7645 0.1785 1.0394 4.0880 1.2661 2.0258 10.5953 0.1364 28.6729 82.3000 0.9798 47.7389 0.9030 13.8844 18.8776 10.7211 0.2073 1.2980 1.0899 41.2389 18.3573 5.5968 30.9299 49.9467 11.1341 16.1264 1.2307 111.1861 0.1873 44.9480 83.2360 5.9266 20.2840 12.0364 10.6667 2.2276 43.7699 3.3890 3.2016 0.4805 0.6986 5.4710 18.4526 2.5969 1.8965 2.9391 2.6369 11.1419 7.8415 10.6387 12.1409 5.6646 186.3075 29.5927 18.8976 11.0319 33.3160 9.4046 1.0111 1.0564 8.5143 4.8096 4.3851 12.0455 12.3298 18.8332 13.0952 536.2826 51.6965 13.7332 11.3340 54.1782 67.5301 26.4385 24.0632 24.4896 11.7680 5.9220 78.7837 16.1285 14.3399 9.8785 11.1521 13.5159 15.0472 8.4477 10.7754 23.2528 93.9134 91.5539 20.3112 32.8173 31.7834 6.2056 7.1408 18.4382 11.1208
temp: 298.150 k
press: 1.00000 atm
elementType: 35 35 8 8 7 7 6 6 6 6 6 6 6 6 6 6 6 6 6 6 6 6 1 1 1 1 1 1 1 1 1 1 1 1 1 1 1 1 1 1 1 1 1 1 1 1 1 1 1 1
symmnumber: 1
zpe: 1109238.7 jmol-1
zpe.correction: 0.422487 hartree
zpe.thermalcorrener: 0.448835 hartree
zpe.thermalcorrenthalpy: 0.449779 hartree
zpe.thermalcorrgfe: 0.360371 hartree
zpe.sumelectzpe: -911.642547 hartree
zpe.sumelectthermal: -911.616199 hartree
zpe.sumelectthermalent: -911.615255 hartree
zpe.sumelectthermalfe: -911.704663 hartree
dipole: 0.6726 4.3552 -0.0828
dipole: 4.4076
quadrupole: -157.1862 -156.0623 -161.6672
quadrupole: -1.3468 11.9282 0.2675
quadrupole: 1.1190 2.2430 -3.3620 -1.3468 11.9282 0.2675
hfenergy: -912.0650339 hartree
pointgroup: C01 [X(C16H28Br2N2O2)]
dipole: 0.2570164 -1.7146891 -0.0292779 debye
polarizability: 289.9228266|-1.6354713|224.8716445|4.5990481|1.5008414|191.9726563 unknown
InChI: InChI=1S/C16H28Br2N2O2/c1-3-5-7-13(17)15(21)19-9-11-20(12-10-19)16(22)14(18)8-6-4-2/h13-14H,3-12H2,1-2H3
charge 0 multiplicity 1
50 atoms
Br -3.89877 2.423187 1.703529
Br 3.293066 2.355839 -1.638146
O  -3.252257 0.656429 -1.537731
O  3.12558 0.415832 1.544326
N  -1.420024 0.786099 -0.112745
N  1.333008 0.022476 0.115215
C  -0.743184 0.86991 1.198812
C  -0.505346 0.97639 -1.260412
C  0.416781 -0.151148 1.264357
C  0.658801 -0.039324 -1.200781
C  -2.785177 0.673696 -0.354928
C  2.671446 0.312924 0.361089
C  -3.733416 0.543357 0.851804
C  3.613945 0.467187 -0.847011
C  -5.125616 0.037997 0.470838
C  5.09041 0.318109 -0.47792
C  -5.109445 -1.461941 0.074537
C  5.445126 -1.145942 -0.104994
C  -6.528233 -1.975933 -0.265291
C  6.950576 -1.306379 0.212741
C  -6.541478 -3.469496 -0.654699
C  7.322975 -2.753423 0.600136
H  -0.341422 1.893609 1.335847
H  -1.449049 0.682378 2.020463
H  -1.090666 0.846629 -2.184707
H  -0.094534 2.005279 -1.236722
H  0.006141 -1.180578 1.246493
H  1.004816 -0.012144 2.185742
H  1.36399 0.191841 -2.011718
H  0.26093 -1.062267 -1.356097
H  -3.303648 -0.055942 1.671798
H  3.342589 -0.194931 -1.686182
H  -5.805207 0.18264 1.331262
H  -5.504942 0.637676 -0.374851
H  5.31379 0.979423 0.377276
H  5.707841 0.640484 -1.337034
H  -4.692627 -2.070045 0.905505
H  -4.450072 -1.603324 -0.802443
H  5.176404 -1.827678 -0.93972
H  4.852024 -1.453596 0.776827
H  -7.196629 -1.811332 0.604326
H  -6.940187 -1.370477 -1.097062
H  7.548008 -0.990119 -0.666451
H  7.219416 -0.619006 1.03943
H  -7.563442 -3.8127 -0.898863
H  -6.161961 -4.099973 0.171722
H  -5.902833 -3.6535 -1.538933
H  8.401292 -2.844751 0.825335
H  7.08839 -3.458448 -0.219833
H  6.761919 -3.080095 1.495664
