program: Gaussian 09
title: 000237516
version: EM64L-G09RevD.01
frameworkgroup: C1[X(C6H8ClN2O2P)]
method: RPBEPBE
basis: SDD
operation: Freq
keyword: #p
keyword: freq=noraman
keyword: PBEPBE/SDD
title: #p freq=noraman PBEPBE/SDD
converged: YES YES NO NO
title: Mulliken charges:
elementType: Cl P O O N N C C C C C C H H H H H H H H
charge: -0.067398 1.361690 -0.660864 -0.607596 -0.852237 -0.961815 0.540072 -0.408856 -0.360120 -0.186594 -0.201084 -0.115199 0.345705 0.225682 0.314182 0.253911 0.254587 0.373745 0.362382 0.389806
chargesum: 0.00000
title: Mulliken charges with hydrogens summed into heavy atoms:
elementType: Cl P O O N N C C C C C C
charge: -0.067398 1.361690 -0.271057 -0.607596 -0.506532 -0.225687 0.540072 -0.183174 -0.045938 0.067317 0.053503 -0.115199
polarizability: 1.82658649e+02 -7.25639688e+00 1.06881530e+02 1.00596455e+00 8.05369706e-01 6.35767232e+01
1716.lowfreq: -9.1000 -6.5231 0.0010 0.0018 0.0019 6.0015 40.5661 49.4735 109.4910
frequency: 40.5584 49.4670 109.4835 118.2843 197.6430 212.4106 223.0502 276.0378 297.9187 314.5734 332.4708 346.4620 381.7750 383.9590 411.9671 463.8168 505.0103 527.5693 602.7240 620.1387 647.2696 678.5036 706.4470 758.1737 812.7870 834.6619 844.5532 894.8525 936.4542 978.6325 986.1404 992.7651 1005.1966 1073.8425 1084.0744 1116.6302 1191.6096 1249.8940 1299.3511 1335.6999 1397.5002 1442.9786 1481.3644 1566.5542 1589.9287 1607.5987 3127.5185 3151.4995 3169.0071 3172.3007 3532.1839 3548.5904 3594.7403 3693.5531
redmass: 6.5292 4.5648 7.9177 6.8777 3.2627 7.4495 7.2798 3.5124 1.8010 3.5916 2.1870 3.2000 2.0731 3.9907 3.0483 6.0037 2.4627 1.4841 1.4161 5.6604 6.9921 6.3314 3.4001 5.6211 1.3999 4.3050 1.5245 4.6053 1.3633 1.3210 1.5439 4.3047 1.6732 2.5161 2.5307 1.3499 1.1251 2.2301 1.3556 2.7549 4.0638 1.8638 2.5246 1.1082 6.3734 6.0838 1.0897 1.0905 1.0954 1.0967 1.0754 1.0450 1.0660 1.1022
irintensity: 0.2832 0.5652 0.7956 1.5246 10.9864 4.0164 3.1230 15.6731 39.1549 4.3359 43.9139 27.6030 43.6983 54.7662 0.2457 14.0544 51.0254 320.9165 44.0975 3.7297 26.8857 183.8170 2.3536 57.8182 40.6822 87.5245 115.1843 214.9592 2.7826 3.1029 178.6253 26.9649 7.5691 18.8563 129.1626 21.3241 5.6193 59.5753 18.5703 117.6239 15.0062 42.1331 284.5543 76.0271 0.1272 41.1363 13.9734 5.7967 4.5125 4.4196 26.9215 75.2320 61.0513 54.0723
temp: 298.150 k
press: 1.00000 atm
elementType: 17 15 8 8 7 7 6 6 6 6 6 6 1 1 1 1 1 1 1 1
symmnumber: 1
zpe: 370352.9 jmol-1
zpe.correction: 0.141060 hartree
zpe.thermalcorrener: 0.153672 hartree
zpe.thermalcorrenthalpy: 0.154616 hartree
zpe.thermalcorrgfe: 0.101451 hartree
zpe.sumelectzpe: -1293.783753 hartree
zpe.sumelectthermal: -1293.771141 hartree
zpe.sumelectthermalent: -1293.770197 hartree
zpe.sumelectthermalfe: -1293.823362 hartree
dipole: -3.4074 3.2041 -0.1944
dipole: 4.6812
quadrupole: -84.2281 -81.7971 -83.0725
quadrupole: -4.9724 3.2370 -5.7378
quadrupole: -1.1955 1.2355 -0.0399 -4.9724 3.2370 -5.7378
hfenergy: -1293.9248134 hartree
pointgroup: C01 [X(C6H8Cl1N2O2P1)]
dipole: -1.2452296 1.349804 0.1394769 debye
dipolederiv: -0.8839442 0.1647502 0.0564 0.1892444 -0.1723864 -0.0235077 0.0472229 -0.0182403 -0.0801236 2.9875381 -0.0633206 -0.1109892 0.4210816 1.6279387 -0.1812526 -0.2327089 -0.1866095 1.8611628 -0.9282753 -0.0932058 0.170012 -0.1902148 -0.4164573 -0.0236872 0.4317007 0.0360359 -1.1308922 -0.8925531 -0.0035166 0.0215484 -0.0468449 -0.6757954 -0.0242407 0.0556859 0.0103063 -0.6625362 -2.0638014 0.1010962 0.1088479 -0.1611424 -0.4952485 0.0634755 -0.0557937 0.0427495 -0.6016231 -1.1024536 0.0664564 -0.2103914 0.1801729 -1.0395642 -0.0080052 -0.2235933 -0.0495586 -0.5994322 1.5100012 -0.162349 -0.1056402 -0.5897814 0.024383 0.0530405 -0.0506323 0.0003103 0.1132166 -0.3429152 0.0591712 0.0335192 -0.1071974 0.0699719 0.0594543 0.0167309 0.041394 -0.2000322 -0.2528842 -0.0091996 0.0151277 0.2742269 -0.0543814 0.0007237 0.0236352 0.0307717 -0.1686898 -0.1565812 0.0221222 0.0059958 0.085519 0.0324626 0.0187716 0.0153571 0.0244175 -0.0822192 -0.1540236 0.0694975 0.0191141 0.001253 0.0701439 0.0359965 -0.0063099 0.0295302 -0.0843482 1.1101646 -0.272711 -0.0768278 -0.2929834 0.0645364 0.0304595 -0.0722647 0.0271577 -0.090424 0.09279 -0.0718955 0.0233409 -0.0244998 0.129133 -0.0224482 0.0237673 -0.0245915 0.3164313 0.0375869 0.0931371 0.0160435 0.071747 -0.0725419 -0.0485548 0.0192315 -0.0476226 0.1547853 0.1645602 -0.0519449 -0.023216 -0.0214407 0.0797618 -0.0153171 -0.0147071 -0.0144566 0.1700529 0.0093111 -0.077729 -0.0099395 -0.0716308 0.0320989 -0.0221494 -0.0142209 -0.0197478 0.1614444 0.0795737 0.0392057 0.0096342 0.0466954 -0.0251933 -0.0356401 0.0152741 -0.0336182 0.1532843 0.2160326 0.0252832 0.0350782 0.0538732 0.3246855 0.0972892 -0.0270337 0.0934078 0.2292378 0.2339327 0.0805285 0.017639 0.0559053 0.3472292 0.0354629 0.0964944 0.0217486 0.1910152 0.3359409 0.0846237 0.0047034 0.1260168 0.1492236 0.0101292 -0.0478355 0.0366155 0.3496899 unknown
polarizability: 180.4149032|-11.9001176|107.8237436|-10.3899194|5.2279822|64.8782559 unknown
InChI: InChI=1S/C6H8ClN2O2P/c7-5-1-3-6(4-2-5)9-12(8,10)11/h1-4,9-10H,8H2
charge 0 multiplicity 1
20 atoms
Cl 4.675863 -0.686086 -0.328141
P  -2.59983 -0.077647 0.252252
O  -3.145879 0.034915 1.907181
O  -2.423665 -1.592788 -0.216888
N  -1.173162 0.887392 0.016205
N  -3.783515 0.984738 -0.37975
C  0.188037 0.472636 -0.054684
C  1.197647 1.459335 0.109754
C  0.562487 -0.875729 -0.303499
C  2.562338 1.113958 0.020321
C  1.927954 -1.222948 -0.380175
C  2.910764 -0.228312 -0.219599
H  -1.333634 1.893701 0.114301
H  0.92122 2.501635 0.310234
H  -0.209263 -1.638414 -0.445037
H  3.336115 1.877107 0.144075
H  2.217666 -2.260146 -0.572308
H  -4.674131 1.07333 0.107191
H  -3.75205 1.268721 -1.357344
H  -2.967062 -0.797001 2.415609
