program: Gaussian 09
title: 000237527
version: EM64L-G09RevD.01
frameworkgroup: C1[X(C15H15NO3S)]
method: RPBEPBE
basis: SDD
operation: Freq
keyword: #p
keyword: freq=noraman
keyword: PBEPBE/SDD
title: #p freq=noraman PBEPBE/SDD
converged: YES YES NO NO
title: Mulliken charges:
elementType: S O O O N C C C C C C C C C C C C C C C H H H H H H H H H H H H H H H
charge: 0.897583 -0.551399 -0.545125 -0.247841 -0.444239 -0.770527 -0.089585 0.523714 -0.249379 -0.238790 0.504359 -0.327372 -0.428369 -0.345714 -0.349114 -0.218895 -0.218566 -0.227439 0.220643 -0.796721 0.271054 0.268772 0.283060 0.289816 0.319162 0.230418 0.241428 0.239144 0.230706 0.230070 0.314360 0.231785 0.241613 0.273174 0.238212
chargesum: 0.00000
title: Mulliken charges with hydrogens summed into heavy atoms:
elementType: S O O O N C C C C C C C C C C C C C C C
charge: 0.897583 -0.551399 -0.545125 -0.247841 -0.129879 -0.230701 -0.089585 0.523714 0.033681 0.051026 0.504359 -0.008210 -0.197951 -0.104286 -0.109969 0.011811 0.011504 0.004347 0.220643 -0.043723
polarizability: 3.73377549e+02 -4.87403468e-01 1.92806812e+02 5.95025175e+00 -1.12547854e+01 1.12946870e+02
1716.lowfreq: -74.5557 -7.0350 -1.5394 -0.0022 -0.0022 -0.0003 7.3943 13.1542 23.2741
frequency: -74.5460 13.1435 23.2653 31.1030 49.0748 64.3832 76.5702 86.4923 99.2999 157.1287 173.1184 184.6240 197.0539 206.4644 302.4578 310.8773 332.0690 343.8895 354.9087 374.2450 402.2042 414.3800 421.3807 469.3486 514.1830 534.2700 554.0909 577.1999 583.6014 615.7000 619.3238 647.4834 674.2111 693.9034 725.7806 769.0942 792.7160 812.7156 817.4567 837.2424 846.3755 861.4998 869.9208 926.2976 927.7023 939.4076 963.5293 977.0830 982.8188 989.1765 990.8553 998.7703 999.1823 1026.5987 1032.7273 1054.0405 1073.4893 1116.1148 1123.1193 1175.6988 1182.1712 1183.8996 1194.7362 1216.3052 1235.4804 1262.1189 1293.9096 1331.0581 1368.2266 1378.6445 1389.2308 1403.4789 1421.1179 1443.1767 1446.8680 1467.7498 1475.3053 1484.6559 1503.8419 1589.5413 1595.1976 1600.0308 1611.5288 1639.7954 2989.0476 3057.1342 3073.9225 3122.0242 3128.8420 3135.1943 3138.5613 3145.1308 3148.6947 3151.5313 3155.9623 3158.2830 3169.4305 3197.5726 3520.8403
redmass: 1.0450 4.8051 5.7937 4.2421 5.3970 5.0786 4.8305 5.6689 6.4843 5.7220 6.6091 5.7450 7.8085 7.1038 7.3055 6.8547 5.8391 2.0825 4.6492 5.0285 2.7760 2.9809 6.3702 6.9244 3.5522 3.9446 4.4263 4.4665 2.9269 6.3018 6.9716 1.1939 6.0755 1.6888 3.4046 2.1523 8.5203 4.3033 4.4316 1.4227 1.2685 2.1369 1.4210 1.4488 5.8141 3.9352 1.3569 1.3976 1.9040 5.4857 3.5012 1.3677 1.3322 2.1906 1.6696 2.4153 1.4742 1.2443 1.2107 1.0533 1.1342 1.1566 1.1160 3.3701 2.8189 1.9099 1.3996 1.2733 4.0004 1.2552 8.8915 4.9680 1.1763 2.2239 1.1323 1.0466 2.2916 2.3400 2.0490 5.9432 6.4481 5.6292 5.9851 5.2291 1.0386 1.0567 1.0983 1.0897 1.0849 1.0881 1.0979 1.0927 1.1116 1.0913 1.0971 1.0952 1.1018 1.0949 1.0765
irintensity: 0.0475 0.3774 0.3657 4.6343 3.8054 1.1723 5.5784 3.9911 1.5520 0.6749 6.5520 7.4970 0.2816 12.8361 1.1241 8.5704 10.0165 0.3355 29.5932 1.0728 0.0286 0.0304 20.7799 53.3324 52.2566 26.7790 59.4112 22.6023 1.4593 0.0100 3.8279 62.0923 2.6089 52.1749 2.3865 10.2566 92.0950 5.5743 15.5233 29.9069 0.1087 16.2211 42.7442 2.1314 9.8636 42.4504 2.7252 0.1004 21.9197 0.8027 8.3796 0.0191 3.6772 5.7260 8.3809 47.2280 13.9057 3.5237 9.1897 0.0325 57.5903 0.9634 0.0690 64.2273 19.1305 69.3466 51.2823 0.3965 237.9771 81.2037 1.4029 15.7343 5.1596 11.3196 48.3934 20.7888 61.3885 7.0413 450.9240 1.0990 94.3478 27.6429 3.0417 120.8207 6.8933 16.1328 13.2613 17.4139 1.2548 0.6516 6.4011 18.6107 0.3220 2.1481 28.5199 10.6605 24.2391 8.9305 14.6431
temp: 298.150 k
press: 1.00000 atm
elementType: 16 8 8 8 7 6 6 6 6 6 6 6 6 6 6 6 6 6 6 6 1 1 1 1 1 1 1 1 1 1 1 1 1 1 1
symmnumber: 1
zpe: 698266.9 jmol-1
zpe.correction: 0.265956 hartree
zpe.thermalcorrener: 0.284835 hartree
zpe.thermalcorrenthalpy: 0.285779 hartree
zpe.thermalcorrgfe: 0.215368 hartree
zpe.sumelectzpe: -1257.501840 hartree
zpe.sumelectthermal: -1257.482961 hartree
zpe.sumelectthermalent: -1257.482017 hartree
zpe.sumelectthermalfe: -1257.552428 hartree
dipole: -3.6704 2.8759 -5.2744
dipole: 7.0400
quadrupole: -87.9765 -122.5626 -136.4114
quadrupole: -23.6738 -2.8301 -4.5230
quadrupole: 27.6736 -6.9124 -20.7612 -23.6738 -2.8301 -4.5230
hfenergy: -1257.7677956 hartree
pointgroup: C01 [X(C15H15N1O3S1)]
dipole: 1.4338122 -1.1117203 -2.0928056 debye
polarizability: 373.3390821|-1.2061553|192.5169353|-6.546726|12.2910429|113.275214 unknown
InChI: InChI=1S/C15H15NO3S/c1-12(17)16-14-7-9-15(10-8-14)20(18,19)11-13-5-3-2-4-6-13/h2-10,16H,11H2,1H3
charge 0 multiplicity 1
35 atoms
S  -1.162792 -0.268837 0.867275
O  -1.60399 -1.792234 1.283008
O  -1.423187 1.02037 1.84377
O  5.551055 1.684214 -0.156318
N  4.818066 -0.54326 -0.300198
C  -2.045643 0.143223 -0.91312
C  0.685982 -0.320967 0.477941
C  -3.514208 0.212102 -0.722962
C  1.427348 0.870314 0.535871
C  1.268171 -1.5687 0.197127
C  3.429669 -0.418282 -0.031056
C  2.812743 0.82811 0.27477
C  2.650855 -1.610693 -0.059569
C  -4.133992 1.439394 -0.359815
C  -4.313657 -0.955698 -0.861722
C  -5.528747 1.500964 -0.161869
C  -5.708312 -0.890967 -0.663902
C  -6.319289 0.337522 -0.317119
C  5.797695 0.460869 -0.351339
C  7.196959 -0.065829 -0.665386
H  -1.555221 1.0935 -1.1720
H  -1.683379 -0.697258 -1.523579
H  0.939435 1.811169 0.812139
H  0.657984 -2.477764 0.214459
H  3.42205 1.732425 0.309223
H  3.130548 -2.573559 -0.275922
H  -3.518522 2.335497 -0.222488
H  -3.837163 -1.910039 -1.112539
H  -5.998999 2.449492 0.118844
H  -6.317861 -1.794545 -0.772284
H  5.145769 -1.495817 -0.47983
H  -7.403025 0.386427 -0.162974
H  7.543661 -0.771331 0.112395
H  7.890802 0.785726 -0.702612
H  7.222692 -0.587838 -1.639919
