program: Gaussian 09
title: 000237515
version: EM64L-G09RevD.01
frameworkgroup: C1[X(C14H26O2)]
method: RPBEPBE
basis: SDD
operation: Freq
keyword: #pfreq=noraman
keyword: PBEPBE/SDD
title: #p freq=noraman PBEPBE/SDD
converged: YES YES NO NO
title: Mulliken charges:
elementType: O O C C C C C C C C C C C C C C H H H H H H H H H H H H H H H H H H H H H H H H H H
charge: -0.173471 -0.178308 -0.361093 -0.378021 -0.366863 -0.380138 -0.352316 -0.342679 -0.505794 -0.518437 -0.356294 -0.357781 0.098855 0.107529 -0.695618 -0.695243 0.187799 0.188095 0.183792 0.223505 0.213342 0.214019 0.202657 0.216525 0.189566 0.189646 0.181247 0.192544 0.258226 0.253379 0.258788 0.251053 0.194746 0.194740 0.193309 0.197106 0.210279 0.215984 0.210253 0.208934 0.210885 0.215249
chargesum: 0.00000
title: Mulliken charges with hydrogens summed into heavy atoms:
elementType: O O C C C C C C C C C C C C C C
charge: -0.173471 -0.178308 0.014801 0.029277 0.060498 0.039044 0.026897 0.031112 0.005812 -0.008596 0.033193 0.032634 0.098855 0.107529 -0.059103 -0.060175
polarizability: 1.98388603e+02 4.75683919e-01 1.41521725e+02 2.52940145e+00 -8.57273536e+00 1.30391620e+02
1716.lowfreq: -4.3718 -0.0010 0.0007 0.0015 0.8960 11.4059 16.2228 20.9724 34.2831
frequency: 15.1883 20.9140 34.2522 36.4266 45.8380 51.8646 60.0219 78.8092 100.0768 111.9986 123.6640 132.5085 135.4395 140.9746 189.4973 218.0609 227.8919 229.9180 243.7654 303.5009 316.2218 343.6338 378.7514 410.3177 438.5103 466.9750 516.6505 567.0614 668.0594 717.5579 725.7951 730.5227 745.6113 774.5367 780.7626 833.1227 853.3075 877.9870 884.2919 889.7895 921.5297 962.5544 971.1350 1004.5852 1011.6243 1027.0597 1047.3422 1063.2465 1070.8883 1080.1718 1083.0029 1085.9434 1109.1664 1110.9569 1125.9931 1158.5128 1176.2200 1189.4389 1207.0180 1232.2879 1235.4787 1252.4635 1265.8706 1272.4416 1287.2103 1287.7744 1289.0041 1291.9904 1296.7640 1314.3018 1332.8192 1346.9248 1352.4606 1357.2428 1360.9008 1364.4766 1388.8466 1390.0116 1413.0791 1413.8705 1457.4387 1462.3764 1463.7278 1464.2955 1469.3430 1471.7219 1477.1542 1477.2266 1478.8313 1480.5828 1487.0529 1487.9858 1610.2689 1615.0844 2951.0373 2952.5723 2956.4682 2960.1527 2964.4996 2967.6455 2968.2397 2968.3161 2971.7000 2972.2022 2986.1417 2987.8797 2988.6602 2993.8204 3002.3104 3007.0829 3013.4423 3021.1807 3029.3404 3031.4506 3052.0780 3052.6899 3068.5707 3068.6064 3070.5733 3071.4765
redmass: 2.9142 3.3029 2.4288 2.5543 2.6810 3.8078 3.2982 1.9350 3.0900 2.1231 1.9950 2.3808 2.0450 3.5592 3.4899 4.3095 1.1262 1.1148 2.8842 3.8160 2.8726 3.2479 3.8340 3.6492 3.2490 2.8417 5.2834 2.1041 2.7519 1.1216 1.1003 1.1382 1.6529 1.4168 1.8900 1.6953 1.4346 1.6033 1.9746 1.8896 3.0423 1.2942 1.2902 2.1333 3.7085 3.2619 2.9584 1.4555 2.4744 2.1549 2.0711 1.6000 1.9431 2.2962 2.4107 2.4809 1.5321 1.6330 1.4919 1.3248 1.3699 1.2886 1.2825 1.1436 1.2002 1.1491 1.1336 1.1003 1.1454 1.3284 1.5021 1.7040 1.5537 1.6629 1.6072 1.7732 1.2187 1.2178 1.1024 1.0975 1.0795 1.0713 1.0680 1.0749 1.0760 1.0733 1.0432 1.0422 1.0731 1.0778 1.0862 1.0866 9.0711 9.4818 1.0591 1.0590 1.0590 1.0614 1.0649 1.0591 1.0613 1.0604 1.0372 1.0365 1.0626 1.0965 1.0609 1.0949 1.0973 1.0987 1.0980 1.0940 1.1040 1.1009 1.1031 1.1034 1.1006 1.1007 1.0994 1.0993
irintensity: 1.2321 0.0484 0.1962 0.1098 0.8844 1.0325 3.2901 1.2074 0.1143 0.8762 0.0991 1.1317 0.0535 1.6739 0.9775 5.3780 0.0340 0.0078 4.9106 4.5880 3.0991 1.1862 14.8169 7.6728 0.0852 3.1157 0.0282 0.2320 9.8008 16.0834 16.3395 1.1351 12.0387 5.6696 3.4604 2.0456 7.5050 2.7288 3.2309 4.0488 70.6218 1.6540 1.7204 3.8874 0.1245 1.5453 1.3636 0.9534 0.1687 0.3065 0.2955 5.4048 5.2012 4.5040 21.0717 2.0754 0.9375 0.3427 2.8752 0.0647 17.6172 1.3008 5.5223 0.0232 7.6868 5.9264 2.9870 0.4841 2.5717 1.0249 16.2320 13.6892 3.4235 2.3100 0.1080 8.6380 12.1116 10.9140 26.7644 50.1469 5.4165 0.3086 0.1659 0.7594 1.2906 2.6150 11.8735 12.4612 4.5216 3.9221 19.7318 22.2628 3.2238 121.0719 3.0314 7.5054 12.3521 5.8274 20.9674 83.2318 61.2420 51.5097 32.1640 31.8171 42.3377 2.1830 34.1461 8.7894 2.4204 0.1219 2.3549 10.2111 30.9607 20.0521 70.0431 56.9510 93.8354 97.6687 56.9959 53.5489
temp: 298.150 k
press: 1.00000 atm
elementType: 8 8 6 6 6 6 6 6 6 6 6 6 6 6 6 6 1 1 1 1 1 1 1 1 1 1 1 1 1 1 1 1 1 1 1 1 1 1 1 1 1 1
symmnumber: 1
zpe: 972288.3 jmol-1
zpe.correction: 0.370325 hartree
zpe.thermalcorrener: 0.391317 hartree
zpe.thermalcorrenthalpy: 0.392261 hartree
zpe.thermalcorrgfe: 0.315863 hartree
zpe.sumelectzpe: -698.220190 hartree
zpe.sumelectthermal: -698.199198 hartree
zpe.sumelectthermalent: -698.198254 hartree
zpe.sumelectthermalfe: -698.274653 hartree
dipole: -0.1718 -0.0359 0.1747
dipole: 0.2477
quadrupole: -96.6415 -102.4103 -103.9856
quadrupole: 4.9704 -4.1604 5.3148
quadrupole: 4.3710 -1.3978 -2.9732 4.9704 -4.1604 5.3148
hfenergy: -698.5905154 hartree
pointgroup: C01 [X(C14H26O2)]
dipole: 0.0676019 -0.0673071 0.019877 debye
polarizability: 198.3471042|2.9369692|129.2651646|1.1126102|-7.6653248|142.6896793 unknown
InChI: InChI=1S/C14H26O2/c1-3-5-7-9-11-13(15)14(16)12-10-8-6-4-2/h3-12H2,1-2H3
charge 0 multiplicity 1
42 atoms
O  0.775413 0.863269 -2.418902
O  -1.010642 -1.291938 -0.232589
C  4.163908 -0.279841 0.154916
C  -3.902236 0.302291 -0.638339
C  3.075883 0.21285 -0.824634
C  -3.329791 -0.552729 -1.793503
C  5.54891 0.348858 -0.117143
C  -5.33362 -0.116659 -0.23645
C  1.701373 -0.415932 -0.537659
C  -1.906192 -0.138813 -2.212344
C  6.642313 -0.133566 0.863181
C  -5.922829 0.744716 0.904273
C  0.600563 0.050441 -1.471457
C  -0.826033 -0.52718 -1.217382
C  8.02247 0.499964 0.584242
C  -7.348131 0.312817 1.311524
H  3.856967 -0.048953 1.196845
H  4.246228 -1.385511 0.093576
H  -3.904404 1.371424 -0.938866
H  -3.237657 0.218295 0.243926
H  2.993499 1.315926 -0.770817
H  3.375835 -0.015974 -1.865853
H  -3.998637 -0.471272 -2.672972
H  -3.325201 -1.616769 -1.486615
H  5.468135 1.45452 -0.058919
H  5.861101 0.115435 -1.156629
H  -6.000664 -0.054606 -1.122297
H  -5.328339 -1.181727 0.076019
H  1.371037 -0.215211 0.502973
H  1.744482 -1.524455 -0.590419
H  -1.82881 0.949836 -2.403978
H  -1.622479 -0.603495 -3.181599
H  6.329535 0.10068 1.901397
H  6.722402 -1.238455 0.804974
H  -5.932967 1.808429 0.589395
H  -5.25168 0.68791 1.785446
H  7.975523 1.602504 0.664647
H  8.785799 0.141152 1.298968
H  8.372339 0.253773 -0.436173
H  -8.045348 0.387176 0.455449
H  -7.358648 -0.73673 1.661555
H  -7.745909 0.944852 2.126838
