program: Gaussian 09
title: 000237499
version: EM64L-G09RevD.01
frameworkgroup: C1[X(C15H13NS)]
method: RPBEPBE
basis: SDD
operation: Freq
keyword: #p
keyword: freq=noraman
keyword: PBEPBE/SDD
title: #p freq=noraman PBEPBE/SDD
converged: YES YES NO NO
title: Mulliken charges:
elementType: S N C C C C C C C C C C C C C C C H H H H H H H H H H H H H
charge: 0.187683 -0.004887 -0.471711 -0.564237 -0.111765 0.504561 -0.335588 0.327220 -0.393291 -0.409850 -0.279385 -0.346237 -0.221916 -0.223358 -0.237556 -0.214911 -0.241260 0.253767 0.232005 0.225220 0.219859 0.237009 0.227495 0.245304 0.259391 0.224755 0.223185 0.229894 0.231647 0.226958
chargesum: 0.00000
title: Mulliken charges with hydrogens summed into heavy atoms:
elementType: S N C C C C C C C C C C C C C C C
charge: 0.187683 -0.004887 0.014062 -0.119159 -0.111765 0.504561 -0.335588 0.327220 -0.156282 -0.182355 -0.034081 -0.086846 0.002839 -0.000173 -0.007663 0.016736 -0.014302
polarizability: 2.09839318e+02 -2.74172740e+01 1.74990099e+02 3.19825945e+01 8.78379540e+00 1.42531625e+02
1716.lowfreq: -13.9095 -1.8644 0.0004 0.0014 0.0023 8.6353 15.3514 20.8817 34.2452
frequency: 14.5401 20.5731 34.1645 86.1618 104.6029 161.3251 189.7543 257.3546 276.6163 342.8658 362.8851 385.8767 402.7256 430.9470 460.3144 483.9770 488.4241 526.6555 536.2488 576.9484 603.3100 618.2326 643.9614 678.8347 704.0424 735.2324 752.7208 765.3118 767.9988 837.9819 852.2959 864.9589 887.6643 911.6049 934.1784 948.0413 976.1287 985.4369 990.1149 994.0584 1010.1116 1013.3079 1027.1100 1037.8768 1061.5162 1095.3622 1120.0127 1168.6552 1171.9201 1185.6318 1188.5673 1200.3847 1219.1742 1230.3003 1274.2422 1305.0449 1330.4641 1338.6818 1375.3164 1383.5681 1430.3908 1440.5531 1442.1799 1444.8098 1472.4294 1484.8308 1552.4103 1566.4978 1594.5231 1609.3800 1615.3651 2986.1065 2996.1277 3048.3419 3072.4326 3111.8052 3119.3727 3131.9784 3135.3436 3143.8922 3149.9339 3162.1414 3164.3389 3175.3710
redmass: 3.9349 5.9925 5.3245 5.5319 4.3631 4.8019 5.7785 2.8685 5.2003 2.3066 3.7486 4.7955 2.8027 3.3577 4.9098 7.6793 4.1673 4.3534 4.1740 3.9100 5.2238 6.2706 5.1909 6.9805 1.7431 2.4861 3.0134 1.9999 1.6126 5.8714 1.2553 1.3926 1.9700 1.6917 2.1131 1.3867 1.3915 1.3194 5.6721 1.3578 2.7612 2.4974 2.2208 3.5242 2.2724 1.6884 1.5244 1.1179 1.0584 1.2955 1.1242 1.6058 1.8349 2.3269 1.5809 1.3714 1.2547 1.4715 4.5876 7.7133 2.8086 1.4248 2.0586 1.7702 1.1250 2.2641 9.2885 6.2801 6.0731 7.4857 6.1608 1.0615 1.0614 1.1024 1.0983 1.0873 1.0865 1.0910 1.0857 1.0959 1.0904 1.1015 1.0958 1.0996
irintensity: 0.0396 0.0278 0.0299 2.2735 0.0201 0.8252 1.7669 4.0296 0.2156 0.4834 0.3123 0.6209 0.0610 6.0359 8.2350 0.5473 8.4964 18.5862 5.6745 9.0629 4.9468 0.5451 8.5056 5.0968 56.1643 21.0246 22.0857 36.1982 65.4786 5.8779 0.3343 1.0586 20.0457 1.8751 6.1123 2.5192 0.1475 0.0491 0.1240 0.3999 5.7210 12.5370 9.4873 5.7261 40.8618 8.2654 2.7816 1.5325 0.2612 13.7052 1.3060 6.1896 1.3105 6.2209 0.4510 4.1037 0.9151 1.4966 9.6989 0.1508 23.7326 19.3841 0.7461 6.9269 10.4275 16.4839 51.1020 0.3446 1.0482 14.6356 6.1385 12.6822 45.6715 20.9588 15.2202 9.2948 3.7382 11.4961 1.9610 43.2935 9.4798 22.1701 16.8236 17.0188
temp: 298.150 k
press: 1.00000 atm
elementType: 16 7 6 6 6 6 6 6 6 6 6 6 6 6 6 6 6 1 1 1 1 1 1 1 1 1 1 1 1 1
symmnumber: 1
zpe: 618366.9 jmol-1
zpe.correction: 0.235524 hartree
zpe.thermalcorrener: 0.249620 hartree
zpe.thermalcorrenthalpy: 0.250564 hartree
zpe.thermalcorrgfe: 0.191442 hartree
zpe.sumelectzpe: -1031.036166 hartree
zpe.sumelectthermal: -1031.022069 hartree
zpe.sumelectthermalent: -1031.021125 hartree
zpe.sumelectthermalfe: -1031.080247 hartree
dipole: -0.1823 -0.2533 -0.4887
dipole: 0.5798
quadrupole: -97.1833 -98.5159 -105.5760
quadrupole: -5.7634 7.5384 -0.9488
quadrupole: 3.2418 1.9091 -5.1509 -5.7634 7.5384 -0.9488
hfenergy: -1031.271689 hartree
pointgroup: C01 [X(C15H13N1S1)]
dipole: 0.0731111 0.0928942 -0.1951002 debye
polarizability: 209.5349714|-28.6881602|174.8900802|-30.9825796|-9.6133133|142.9359904 unknown
InChI: InChI=1S/C15H13NS/c1-2-6-12(7-3-1)10-11-15-16-13-8-4-5-9-14(13)17-15/h1-9H,10-11H2
charge 0 multiplicity 1
30 atoms
S  1.332792 1.75693 -1.002293
N  0.856534 0.401026 1.285327
C  -0.886934 2.159599 0.855178
C  -2.011075 2.021861 -0.22449
C  0.353872 1.368828 0.556547
C  -2.597599 0.619792 -0.307243
C  2.467817 0.439076 -0.500016
C  2.035874 -0.147671 0.736096
C  -2.084602 -0.335501 -1.221678
C  -3.657656 0.232766 0.552882
C  3.62831 -0.011516 -1.159526
C  2.782789 -1.201418 1.312114
C  -2.615851 -1.644176 -1.274431
C  -4.191877 -1.0743 0.503575
C  4.362895 -1.065022 -0.569066
C  3.943684 -1.653908 0.654628
C  -3.671534 -2.018591 -0.411814
H  -1.263384 1.814889 1.834398
H  -0.623439 3.231347 0.952757
H  -1.603972 2.328416 -1.206469
H  -2.803794 2.748377 0.036723
H  -1.266251 -0.052477 -1.894942
H  -4.070627 0.961854 1.262199
H  3.958809 0.436214 -2.101625
H  2.442927 -1.643047 2.253398
H  -2.207234 -2.369402 -1.987403
H  -5.013244 -1.354558 1.173028
H  5.268579 -1.430363 -1.065168
H  4.530612 -2.469507 1.090062
H  -4.085416 -3.032413 -0.453448
