program: Gaussian 09
title: 000237489
version: EM64L-G09RevD.01
frameworkgroup: C1[X(C16H14N2O)]
method: RPBEPBE
basis: SDD
operation: Freq
keyword: #p
keyword: freq=noraman
keyword: PBEPBE/SDD
title: #p freq=noraman PBEPBE/SDD
converged: YES YES NO NO
title: Mulliken charges:
elementType: O N N C C C C C C C C C C C C C C C C H H H H H H H H H H H H H H
charge: -0.236484 -0.045122 -0.404599 -0.361117 -0.537980 0.066908 0.477538 0.329232 0.200234 -0.425339 -0.368222 -0.381540 -0.373891 -0.226888 -0.228586 -0.240908 -0.251857 -0.230485 -0.237224 0.243966 0.254326 0.267306 0.233116 0.251991 0.337771 0.240871 0.272718 0.227638 0.228235 0.231098 0.227696 0.228590 0.231008
chargesum: 0.00000
title: Mulliken charges with hydrogens summed into heavy atoms:
elementType: O N N C C C C C C C C C C C C C C C C
charge: -0.236484 -0.045122 -0.066828 -0.117151 -0.016348 0.066908 0.477538 0.329232 0.200234 -0.192223 -0.116231 -0.140669 -0.101173 0.000749 -0.000351 -0.009810 -0.024161 -0.001895 -0.006215
polarizability: 2.37722153e+02 1.77625825e+01 1.96106306e+02 -4.85696779e+00 1.75344338e+01 1.40378134e+02
1716.lowfreq: -4.5365 -2.8541 -0.0006 0.0004 0.0005 9.1466 30.0832 36.1142 41.7061
frequency: 30.0204 36.0906 41.6177 68.2292 105.5626 123.6257 159.2285 177.3938 251.2554 268.9315 307.2744 332.9641 377.1691 401.2655 402.5188 439.1496 473.6255 482.5769 516.5748 554.4727 572.7574 612.3699 615.2397 626.4942 662.5044 694.0626 701.0159 704.2346 719.9563 752.7038 771.9233 780.1797 792.2578 850.7775 853.3161 909.1123 924.7469 930.5300 971.2888 977.6259 982.2469 985.0845 989.4623 990.9679 997.3205 1002.2856 1024.1257 1030.7688 1038.2342 1080.0685 1086.5872 1123.8692 1160.5400 1173.1752 1174.0634 1192.7801 1193.3409 1196.5596 1227.6268 1265.4076 1291.9469 1313.5067 1317.7106 1341.2232 1359.9045 1381.7309 1383.0839 1405.9089 1435.5640 1438.5340 1441.9943 1482.7160 1487.8897 1548.1197 1586.2594 1593.3906 1611.5170 1612.4067 1635.6972 2985.8634 3018.7739 3092.6339 3109.9408 3126.8232 3127.1463 3136.1697 3137.8808 3148.6142 3148.9894 3161.3040 3165.1245 3172.0066 3545.9323
redmass: 3.9167 4.5113 4.2266 8.8831 5.1251 5.2928 4.3225 4.3888 3.8488 4.8523 4.2138 6.2413 6.6237 2.8330 2.8165 4.6007 3.7234 4.1983 3.5299 3.9429 6.9983 5.4257 6.3261 4.3616 4.2508 1.7576 1.6386 1.9123 2.7886 3.1931 1.9940 2.5528 3.4327 1.2556 1.2478 2.3631 1.7101 1.5204 3.9747 1.4031 1.5216 2.8734 4.9666 5.7109 1.3286 1.3398 2.8295 2.1414 2.1554 1.7551 1.6024 3.0563 1.6107 1.0629 1.0529 1.1424 1.1974 1.7584 1.4117 2.0176 2.2515 2.2967 1.3982 1.4015 1.8080 7.1025 6.9668 1.4661 2.3070 1.1591 1.9466 2.2158 2.4225 6.1502 6.1622 5.9807 5.9461 6.1460 6.4659 1.0672 1.0838 1.0947 1.0881 1.0848 1.0858 1.0883 1.0911 1.0958 1.0933 1.0967 1.1014 1.0990 1.0784
irintensity: 0.0930 0.1030 0.0931 1.3552 1.0470 0.8012 1.7973 2.4850 1.4465 0.1418 0.9181 2.1403 8.8790 0.0957 0.0572 7.3456 3.2288 2.4209 4.2074 6.0457 33.3869 4.6622 2.5261 10.7716 8.5068 13.5944 138.3638 33.2519 39.5628 32.5158 30.8987 20.7349 5.2811 0.3793 0.2440 19.4145 3.6113 9.5504 7.5857 0.3372 1.5459 24.1669 3.1066 1.4439 0.0237 1.4931 12.5495 6.2803 10.4584 10.5846 13.4177 13.9378 56.3513 0.0914 0.1752 3.4307 3.9361 27.5415 27.8170 31.8988 131.6489 85.8561 3.7147 23.7958 0.8991 0.8568 0.2279 1.4567 12.8164 20.6627 2.5201 19.4375 8.6321 17.7261 7.1489 1.2945 4.1157 2.9409 408.1795 15.3805 17.9314 5.6033 9.8985 1.6548 0.1293 6.0335 11.9826 30.8035 29.8523 21.4728 22.6037 16.0073 43.3231
temp: 298.150 k
press: 1.00000 atm
elementType: 8 7 7 6 6 6 6 6 6 6 6 6 6 6 6 6 6 6 6 1 1 1 1 1 1 1 1 1 1 1 1 1 1
symmnumber: 1
zpe: 685660.4 jmol-1
zpe.correction: 0.261154 hartree
zpe.thermalcorrener: 0.276421 hartree
zpe.thermalcorrenthalpy: 0.277365 hartree
zpe.thermalcorrgfe: 0.216961 hartree
zpe.sumelectzpe: -801.497178 hartree
zpe.sumelectthermal: -801.481911 hartree
zpe.sumelectthermalent: -801.480967 hartree
zpe.sumelectthermalfe: -801.541371 hartree
dipole: -2.2344 -2.7489 -0.8862
dipole: 3.6516
quadrupole: -114.5091 -110.7807 -102.1370
quadrupole: -12.4421 -0.4620 4.2189
quadrupole: -5.3669 -1.6385 7.0053 -12.4421 -0.4620 4.2189
hfenergy: -801.7583318 hartree
pointgroup: C01 [X(C16H14N2O1)]
dipole: -0.8514878 -1.1083391 -0.3324158 debye
polarizability: 236.6783816|18.8836642|197.453107|-6.033092|16.6918362|140.0751034 unknown
InChI: InChI=1S/C16H14N2O/c19-15-11-14(12-7-3-1-4-8-12)16(18-17-15)13-9-5-2-6-10-13/h1-10,14,17H,11H2
charge 0 multiplicity 1
33 atoms
O  2.820575 3.228184 -0.193795
N  -0.480649 1.968867 0.684052
N  0.749203 2.640203 0.670422
C  0.528686 0.393315 -0.983456
C  1.433727 1.584762 -1.422922
C  -0.61507 0.908943 -0.104713
C  1.34429 -0.719888 -0.301981
C  -1.926849 0.214932 -0.07618
C  1.770775 2.532329 -0.281004
C  1.989182 -1.690063 -1.112541
C  1.511016 -0.786175 1.103653
C  -2.09057 -1.072308 -0.660229
C  -3.052706 0.827018 0.547205
C  2.786495 -2.701884 -0.534351
C  2.309104 -1.79772 1.68434
C  2.950458 -2.757764 0.869339
C  -3.341533 -1.725509 -0.623065
C  -4.298767 0.173666 0.581299
C  -4.45192 -1.106667 -0.006041
H  0.096538 -0.031712 -1.907717
H  0.909025 2.184973 -2.194116
H  2.375867 1.225636 -1.866844
H  1.866182 -1.653526 -2.203043
H  1.009521 -0.055833 1.748451
H  0.843714 3.350551 1.399538
H  -1.238545 -1.583151 -1.120749
H  -2.925519 1.817007 0.994717
H  3.275264 -3.44484 -1.174604
H  2.428473 -1.836264 2.772859
H  3.567654 -3.541964 1.321437
H  -3.447034 -2.719383 -1.071888
H  -5.154971 0.66154 1.060449
H  -5.423316 -1.612873 0.017578
