program: Gaussian 09
title: 000237482
version: EM64L-G09RevD.01
frameworkgroup: C1[X(C14H9NO3)]
method: RPBEPBE
basis: SDD
operation: Freq
keyword: #p
keyword: freq=noraman
keyword: PBEPBE/SDD
title: #p freq=noraman PBEPBE/SDD
converged: YES YES NO NO
title: Mulliken charges:
elementType: O O O N C C C C C C C C C C C C C C H H H H H H H H H
charge: -0.184206 -0.184085 -0.419459 -0.385275 0.185863 0.185861 0.086328 0.086492 0.391073 -0.351921 -0.351927 0.192885 -0.315055 -0.212930 -0.212963 -0.373095 -0.245765 -0.198190 0.268682 0.268686 0.247073 0.237516 0.237533 0.221340 0.232328 0.230102 0.363111
chargesum: 0.00000
title: Mulliken charges with hydrogens summed into heavy atoms:
elementType: O O O N C C C C C C C C C C C C C C
charge: -0.184206 -0.184085 -0.056349 -0.385275 0.185863 0.185861 0.086328 0.086492 0.391073 -0.083239 -0.083242 0.192885 -0.067982 0.024586 0.024570 -0.151755 -0.013438 0.031912
polarizability: 2.39166520e+02 7.08880244e-02 1.39618482e+02 -8.17494220e+00 -6.82501710e-03 1.14532373e+02
1716.lowfreq: -27.8977 -7.1309 -5.2635 -3.4960 0.0006 0.0008 0.0009 41.9399 63.2872
frequency: -27.8030 41.9345 63.2852 122.8366 135.6214 175.2967 180.5607 236.0130 237.3383 297.0943 336.3454 340.4863 355.6105 412.1444 452.7475 457.6007 479.7528 522.9780 543.2268 544.2873 561.5556 617.0474 656.9388 682.9749 687.1043 717.1162 734.3981 752.6696 783.1798 786.4583 797.1759 837.6530 849.4507 869.5395 907.4143 936.2368 975.1817 975.6669 1006.3171 1009.4408 1032.7298 1058.9652 1065.1979 1078.9899 1109.9606 1148.3355 1171.2362 1171.2968 1173.1681 1227.9698 1257.0275 1282.7180 1288.6695 1352.2815 1391.3707 1415.1981 1441.8996 1453.7644 1455.3491 1504.3327 1610.2694 1613.0293 1617.3903 1618.9685 1638.9472 1687.2958 3119.2573 3138.5483 3144.0804 3152.4531 3155.2838 3164.4853 3174.1263 3175.2506 3590.5722
redmass: 5.5506 5.9755 5.9058 9.7645 4.9766 5.2102 6.7390 7.5126 6.8167 3.5820 9.3168 1.2031 6.9682 3.2469 4.7605 3.4121 4.7552 7.3020 3.8392 8.0463 9.4271 8.8340 4.8260 5.4175 6.5805 2.8786 4.1011 1.3202 6.0348 5.2873 1.7156 1.5492 6.6615 5.3341 1.3951 1.4087 1.4115 1.3285 1.3441 2.3458 2.1878 5.5821 2.8035 3.4530 2.2356 1.2328 2.0242 1.0864 1.0887 3.6772 2.6158 1.4974 1.4328 5.1903 7.8658 6.5298 2.5322 2.4682 2.7544 3.0553 7.0875 6.9201 7.5497 7.6672 12.5786 12.7231 1.0886 1.0864 1.0883 1.0906 1.0939 1.0956 1.1003 1.1005 1.0662
irintensity: 0.6641 3.5892 5.4388 2.3925 0.0158 0.1792 0.6716 2.2669 1.3841 13.2063 8.0086 104.6868 3.3473 6.3099 0.8554 6.5092 1.5757 9.2799 1.4262 8.3094 0.2452 25.9904 0.0185 9.0967 1.4320 77.3231 0.0060 84.0248 17.1349 0.0150 29.4035 0.0009 46.7951 29.1646 0.0044 1.9823 2.0748 0.9663 0.0000 2.2831 3.3087 100.2305 68.3380 4.1626 52.6091 31.6962 4.0984 10.1344 1.0249 56.4217 29.8167 0.4096 62.8505 327.8862 20.1859 9.6134 25.1607 11.3522 0.0749 96.2143 13.1218 8.7839 1.7931 37.2025 421.8918 26.0542 10.2356 1.8864 3.8835 5.8452 20.3062 6.5029 26.1935 13.6535 40.9048
temp: 298.150 k
press: 1.00000 atm
elementType: 8 8 8 7 6 6 6 6 6 6 6 6 6 6 6 6 6 6 1 1 1 1 1 1 1 1 1
symmnumber: 1
zpe: 512953.3 jmol-1
zpe.correction: 0.195374 hartree
zpe.thermalcorrener: 0.208634 hartree
zpe.thermalcorrenthalpy: 0.209578 hartree
zpe.thermalcorrgfe: 0.155296 hartree
zpe.sumelectzpe: -818.106670 hartree
zpe.sumelectthermal: -818.093410 hartree
zpe.sumelectthermalent: -818.092466 hartree
zpe.sumelectthermalfe: -818.146748 hartree
dipole: -0.6648 -0.0002 1.2257
dipole: 1.3944
quadrupole: -67.7976 -116.2538 -91.8018
quadrupole: -0.0174 4.7867 -0.1296
quadrupole: 24.1535 -24.3027 0.1492 -0.0174 4.7867 -0.1296
hfenergy: -818.3020439 hartree
pointgroup: C01 [X(C14H9N1O3)]
dipole: 0.2535581 -0.3120259 -0.3732255 debye
polarizability: 238.8524914|-7.3210074|129.6652624|-7.2106822|-12.1564452|124.7996214 unknown
InChI: InChI=1S/C14H9NO3/c16-12-8-4-3-7-11(12)15-13(17)9-5-1-2-6-10(9)14(15)18/h1-8,16H
charge 0 multiplicity 1
27 atoms
O  0.133332 1.949588 -1.356746
O  0.08783 -1.677281 1.670708
O  -1.626681 -1.340791 -1.629236
N  -0.253621 0.176191 0.1995
C  1.967187 0.574937 -0.393262
C  1.953691 -0.510844 0.513321
C  0.557875 1.027867 -0.623573
C  0.535054 -0.797686 0.900251
C  -1.688303 0.201376 0.207977
C  3.167073 1.066221 -0.929736
C  3.139574 -1.144085 0.915371
C  -2.397074 -0.583662 -0.73864
C  -2.397824 0.989472 1.135188
C  4.372298 0.432837 -0.530663
C  4.358774 -0.656018 0.378392
C  -3.810891 -0.572989 -0.748405
C  -3.810116 1.004312 1.13007
C  -4.511294 0.220757 0.185672
H  3.163892 1.90671 -1.630695
H  3.1154 -1.984105 1.616484
H  -1.832427 1.587638 1.857052
H  5.32869 0.787652 -0.929588
H  5.304885 -1.125966 0.667696
H  -4.36027 -1.179472 -1.479853
H  -4.354818 1.61867 1.853197
H  -5.606471 0.224906 0.173055
H  -2.201863 -1.85054 -2.251541
