program: Gaussian 09
title: 000237481
version: EM64L-G09RevD.01
frameworkgroup: C1[X(C14H10N2O5)]
method: RPBEPBE
basis: SDD
operation: Freq
keyword: #p
keyword: freq=noraman
keyword: PBEPBE/SDD
title: #p freq=noraman PBEPBE/SDD
converged: YES YES NO NO
title: Mulliken charges:
elementType: O O O O O N N C C C C C C C C C C C C C C H H H H H H H H H H
charge: -0.233718 -0.432440 -0.236619 -0.198235 -0.258692 -0.435966 0.028690 0.196633 0.398644 0.113081 0.110095 0.177683 -0.359666 -0.307529 -0.316047 -0.333328 -0.219277 -0.224655 -0.215969 -0.223759 0.090873 0.365733 0.268312 0.320196 0.283072 0.285948 0.241615 0.239938 0.241601 0.242232 0.391553
chargesum: 0.00000
title: Mulliken charges with hydrogens summed into heavy atoms:
elementType: O O O O O N N C C C C C C C C C C C C C C
charge: -0.233718 -0.040887 -0.236619 -0.198235 -0.258692 -0.070233 0.028690 0.196633 0.398644 0.113081 0.110095 0.177683 -0.091354 0.012667 -0.032975 -0.047380 0.022338 0.015283 0.025632 0.018474 0.090873
polarizability: 2.82976923e+02 1.65681693e+00 2.00303283e+02 2.93217802e+01 -6.21913424e+00 1.12007037e+02
1716.lowfreq: -5.3574 -0.0007 -0.0003 0.0004 2.1386 6.3868 14.3830 31.9886 45.6124
frequency: 14.2726 31.9339 45.6092 53.4281 78.3275 108.3985 115.9060 124.4029 175.3953 186.1441 220.9072 236.5409 288.2166 302.3216 328.6225 360.8051 382.1366 402.3921 411.8238 424.2214 491.4296 523.7680 528.8882 533.5478 583.0443 590.6377 600.0245 649.8710 663.6158 665.5522 682.3873 706.8273 727.2360 752.2625 774.5639 782.4772 785.3499 792.2980 841.3814 870.4167 897.0131 899.1156 905.9614 980.3858 982.8330 1003.9552 1008.4638 1008.7870 1034.3885 1036.3609 1060.5476 1083.2783 1114.2002 1143.0256 1156.6801 1161.1440 1179.8519 1187.7402 1240.8013 1246.5026 1282.0800 1309.8885 1317.7101 1338.8261 1380.1647 1381.8696 1427.2861 1435.0520 1475.4752 1480.9343 1523.7936 1569.8737 1579.5541 1601.8793 1611.3917 1617.2951 1636.5176 3141.2078 3146.3822 3156.0270 3166.6028 3169.9130 3185.4161 3188.1059 3194.7362 3256.5506 3531.5844
redmass: 7.5814 6.8422 7.8823 11.1278 10.8741 7.6945 4.5566 5.5812 6.4457 6.7862 6.3424 6.0833 8.2630 5.7366 9.3137 8.2191 7.7761 8.7173 3.2421 3.7844 5.1367 7.0769 3.7614 5.5431 4.3666 1.3030 4.9667 6.9070 5.9139 5.7872 4.7990 3.8498 4.4393 6.8184 3.9015 1.6692 2.9334 1.8363 5.2528 4.8922 1.3419 1.2459 1.4832 1.4050 1.3422 4.8883 1.3830 1.3210 2.7837 3.2425 3.1228 3.0257 1.8918 1.7625 2.0906 1.7755 1.0689 1.6292 2.0757 1.9772 1.6409 2.8862 2.5860 3.9782 10.4294 4.3245 2.2308 3.0062 2.6230 3.0713 2.5783 7.8654 6.5793 5.5481 3.4229 5.7180 8.8061 1.0865 1.0880 1.0914 1.0924 1.0972 1.0971 1.0956 1.0965 1.0802 1.0643
irintensity: 0.6306 2.3560 2.9150 1.4987 0.5619 1.6760 0.8036 3.1140 6.3349 1.7451 2.2467 2.1826 0.5670 1.8397 4.4851 5.2445 9.1166 4.4323 7.7880 0.9350 12.7472 5.1037 9.8529 1.4829 36.5527 70.8523 31.0733 8.9912 4.9794 22.2437 21.2695 70.8938 18.6611 5.5458 9.4138 69.6721 22.4480 25.9232 1.1247 31.1487 0.1715 82.4002 0.6612 5.2908 4.5348 209.7957 5.9527 1.3380 14.1328 18.1003 14.2453 34.8033 42.1050 17.4680 199.3260 54.5119 0.1342 92.3130 80.6332 71.7591 18.3023 61.1452 78.3228 561.6065 11.8668 81.5771 7.8304 20.5672 20.7094 192.7607 283.4914 216.7432 104.5404 42.0807 1.5328 148.7374 254.4382 2.2674 7.7862 9.4540 10.4128 12.4736 8.6775 4.2049 14.9349 109.9711 52.9533
temp: 298.150 k
press: 1.00000 atm
elementType: 8 8 8 8 8 7 7 6 6 6 6 6 6 6 6 6 6 6 6 6 6 1 1 1 1 1 1 1 1 1 1
symmnumber: 1
zpe: 575849.6 jmol-1
zpe.correction: 0.219330 hartree
zpe.thermalcorrener: 0.236867 hartree
zpe.thermalcorrenthalpy: 0.237811 hartree
zpe.thermalcorrgfe: 0.171463 hartree
zpe.sumelectzpe: -1023.592030 hartree
zpe.sumelectthermal: -1023.574493 hartree
zpe.sumelectthermalent: -1023.573549 hartree
zpe.sumelectthermalfe: -1023.639897 hartree
dipole: -1.1454 -1.1710 -0.3510
dipole: 1.6752
quadrupole: -89.4910 -124.5569 -122.0411
quadrupole: -11.0615 8.7436 12.5710
quadrupole: 22.5387 -12.5272 -10.0114 -11.0615 8.7436 12.5710
hfenergy: -1023.81136 hartree
pointgroup: C01 [X(C14H10N2O5)]
dipole: -0.42667 0.1562087 0.4774335 debye
polarizability: 277.3454995|30.5959903|153.9967753|-29.2898893|41.4957189|163.9449686 unknown
InChI: InChI=1S/C14H10N2O5/c17-13(9-5-1-2-6-10(9)14(18)19)15-11-7-3-4-8-12(11)16(20)21/h1-8,15,18H
charge 0 multiplicity 1
31 atoms
O  -0.401336 1.983593 1.600741
O  -2.543158 -0.513236 -2.769289
O  -0.965369 0.957496 -1.921725
O  3.107181 -2.453015 -1.625663
O  0.9861 -2.058359 -0.920781
N  0.450108 0.114403 0.436957
N  2.253798 -1.72067 -0.998017
C  -1.958962 0.296051 0.827873
C  1.814146 0.412205 0.336982
C  -2.565993 -0.114466 -0.398996
C  -0.576718 0.905562 0.961117
C  2.709839 -0.482399 -0.354182
C  -2.679822 0.141896 2.036931
C  2.379293 1.594205 0.904243
C  -3.851324 -0.718183 -0.375358
C  4.096228 -0.198977 -0.458669
C  -3.960075 -0.451242 2.048624
C  3.752411 1.86099 0.789536
C  -4.542058 -0.895725 0.839346
C  4.622402 0.966995 0.111389
C  -1.92464 0.1755 -1.716158
H  0.198792 -0.774924 -0.034866
H  -2.220383 0.491651 2.966656
H  1.710685 2.281684 1.424434
H  -4.300143 -1.025155 -1.323243
H  4.726937 -0.911939 -0.99527
H  -4.497283 -0.567496 2.995751
H  4.15237 2.778337 1.234737
H  -5.532643 -1.361921 0.841374
H  5.691582 1.183535 0.030522
H  -2.085667 -0.273894 -3.619492
