program: Gaussian 09
title: 000237465
version: EM64L-G09RevD.01
frameworkgroup: C1[X(C15H20O3)]
method: RPBEPBE
basis: SDD
operation: Freq
keyword: #pfreq=noraman
keyword: PBEPBE/SDD
title: #p freq=noraman PBEPBE/SDD
converged: YES YES NO NO
title: Mulliken charges:
elementType: O O O C C C C C C C C C C C C C C C H H H H H H H H H H H H H H H H H H H H
charge: -0.300001 -0.246759 -0.437276 -0.043099 -0.406583 -0.363426 -0.357748 -0.065284 -0.396767 -0.224664 -0.330389 -0.305100 0.487958 -0.388485 -0.400215 -0.232233 -0.234551 -0.241303 0.220000 0.204876 0.209891 0.235567 0.208448 0.189396 0.225620 0.235307 0.214652 0.186479 0.231342 0.186147 0.216775 0.253525 0.329165 0.226677 0.228457 0.226468 0.226821 0.230312
chargesum: 0.00000
title: Mulliken charges with hydrogens summed into heavy atoms:
elementType: O O O C C C C C C C C C C C C C C C
charge: -0.300001 -0.246759 -0.108111 0.176901 0.008184 0.080590 0.057269 0.170022 0.004364 0.006677 0.072533 -0.051575 0.487958 -0.161808 -0.171758 -0.005765 -0.007730 -0.010991
polarizability: 2.05604462e+02 -2.52195885e+01 2.07990163e+02 1.11202907e+01 -3.82131420e+00 1.10383075e+02
1716.lowfreq: -5.4200 -0.0003 0.0005 0.0008 1.3753 6.7309 12.4900 25.1304 32.3446
frequency: 10.4811 25.0036 32.1357 46.9956 56.9605 86.1893 101.0163 106.9199 120.9825 138.1954 185.6101 213.9078 225.8934 258.0253 278.4670 311.4677 330.6768 369.5643 403.4338 460.1670 461.1026 471.1318 487.0182 533.1289 615.8934 620.0543 633.0979 695.2593 720.9747 730.0506 757.7514 773.0679 807.1782 822.4124 844.1370 851.4112 869.3873 896.0719 916.8106 923.9840 947.1299 957.7467 977.4217 988.2266 990.7345 994.4998 1011.0958 1012.6116 1026.6998 1032.8285 1067.9638 1075.6273 1077.3461 1086.5864 1088.1450 1108.7509 1154.1785 1172.6670 1184.8945 1190.1714 1213.4216 1227.2359 1238.0633 1245.6326 1270.7170 1282.4654 1285.4162 1290.9231 1293.8800 1306.2722 1314.7680 1319.3881 1335.5705 1336.5643 1357.7628 1369.9075 1383.7633 1384.7573 1440.1180 1446.8271 1463.4950 1468.0125 1473.2183 1485.3205 1486.0770 1584.8388 1612.2045 1667.6511 2948.7393 2956.2404 2966.3119 2973.8252 2977.4587 2989.0498 3013.0677 3018.7847 3027.7239 3049.8656 3073.8998 3105.4598 3106.3132 3116.8987 3118.3992 3125.6837 3138.0855 3148.3622 3164.9874 3559.1166
redmass: 5.7670 3.6908 1.8327 3.9226 3.9262 4.4220 4.7154 3.5087 2.8394 2.0549 3.5745 5.9480 2.5139 4.7788 3.1491 1.1478 5.0526 3.3846 2.7758 3.6978 2.8210 3.1482 3.7980 4.6281 6.3852 3.5811 5.3891 1.9589 3.2790 1.3021 1.7320 1.9681 1.6073 3.0792 2.1427 1.4796 4.5447 1.6633 2.0117 1.5475 4.9994 4.9336 1.3922 3.9978 2.4720 1.3504 1.4362 1.9778 2.2169 4.4893 2.4468 2.3206 2.5715 1.7072 1.6929 1.9963 1.7230 1.0629 1.2114 1.1304 1.4265 1.2813 1.4921 1.3822 1.3114 1.4426 1.1189 1.2079 1.2656 1.3034 1.3281 1.1837 1.2536 1.2876 1.4388 1.6836 1.2686 6.9960 2.2758 1.0867 1.0720 1.0907 1.0860 2.2962 1.0979 5.8303 5.9895 6.2253 1.0693 1.0630 1.0604 1.0624 1.0723 1.0799 1.0941 1.0867 1.0972 1.1017 1.0979 1.0907 1.0991 1.0886 1.0863 1.0859 1.0913 1.0961 1.1015 1.0661
irintensity: 0.0241 0.0466 2.8343 3.5781 3.2120 1.8211 0.6683 0.2392 3.3503 1.5305 4.5963 1.4104 4.7178 0.3868 2.8600 146.3524 4.3916 8.7578 0.0265 6.4980 7.0324 6.9143 13.8665 20.5937 0.0234 0.9165 7.6586 30.4464 29.7863 7.3782 50.2892 16.7984 9.5612 15.8649 19.2121 5.6176 39.7819 8.8268 3.8268 0.8164 52.2427 55.4788 0.1125 11.3191 49.1886 0.6116 39.0817 4.6104 4.5701 54.7327 32.8736 71.4664 44.8096 24.3541 33.4849 8.9475 10.0687 0.5591 10.3475 1.0347 12.5900 20.8253 2.6293 2.0090 3.4178 15.9959 3.5829 10.2870 21.8279 31.8892 17.1678 4.9494 3.7531 2.8767 3.5617 4.6703 19.8900 4.1599 12.0432 3.2944 0.7359 6.4090 1.6927 15.2276 15.2870 2.7952 2.8433 10.6163 58.4110 12.2220 3.4214 50.8334 43.0742 56.6232 8.3939 37.4798 20.2126 67.1221 64.9126 2.2320 31.4330 3.6376 23.9945 1.2724 10.4175 43.2379 24.9892 6.7771
temp: 298.150 k
press: 1.00000 atm
elementType: 8 8 8 6 6 6 6 6 6 6 6 6 6 6 6 6 6 6 1 1 1 1 1 1 1 1 1 1 1 1 1 1 1 1 1 1 1 1
symmnumber: 1
zpe: 834394.6 jmol-1
zpe.correction: 0.317804 hartree
zpe.thermalcorrener: 0.336049 hartree
zpe.thermalcorrenthalpy: 0.336994 hartree
zpe.thermalcorrgfe: 0.267466 hartree
zpe.sumelectzpe: -807.846810 hartree
zpe.sumelectthermal: -807.828565 hartree
zpe.sumelectthermalent: -807.827621 hartree
zpe.sumelectthermalfe: -807.897148 hartree
dipole: 1.6951 -0.3811 1.3120
dipole: 2.1771
quadrupole: -116.2408 -108.9095 -110.5861
quadrupole: -14.0399 0.1313 1.8633
quadrupole: -4.3287 3.0026 1.3261 -14.0399 0.1313 1.8633
hfenergy: -808.1646143 hartree
pointgroup: C01 [X(C15H20O3)]
dipole: 0.5827306 -0.1170306 0.6167741 debye
polarizability: 203.0490163|-25.0246103|204.5562712|26.0429974|-4.6076368|116.3724121 unknown
InChI: InChI=1S/C15H20O3/c16-11-5-4-8-14-12-17-15(18-14)10-9-13-6-2-1-3-7-13/h1-3,6-7,9-10,14-16H,4-5,8,11-12H2
charge 0 multiplicity 1
38 atoms
O  -1.178045 1.78189 -1.060407
O  -0.513799 3.607566 0.288503
O  -5.178645 -3.646228 -0.796969
C  -2.231361 1.991652 -0.011091
C  -2.758488 0.63633 0.472958
C  -1.505736 2.832012 1.063613
C  -3.453607 -0.174456 -0.64293
C  -0.033691 2.652807 -0.739203
C  -3.952808 -1.553262 -0.155064
C  1.165111 1.876675 -0.237782
C  -4.65827 -2.350752 -1.266924
C  1.250047 0.518034 -0.225766
C  2.383868 -0.300488 0.248793
C  3.559481 0.254769 0.832128
C  2.304104 -1.716309 0.121799
C  4.611306 -0.575799 1.26616
C  3.357037 -2.549856 0.555617
C  4.517296 -1.982839 1.130418
H  -3.042836 2.578881 -0.485886
H  -3.474483 0.814989 1.302426
H  -1.91333 0.056054 0.893476
H  -2.154278 3.562616 1.569765
H  -1.002454 2.18045 1.806593
H  -4.311745 0.407836 -1.038412
H  -2.745472 -0.298766 -1.485399
H  0.208251 3.270016 -1.624395
H  -4.657331 -1.428459 0.690845
H  -3.091693 -2.140967 0.230241
H  1.988241 2.514999 0.11055
H  -3.973582 -2.490273 -2.132227
H  -5.554466 -1.812957 -1.620607
H  0.386891 -0.033614 -0.624842
H  -4.421689 -4.188243 -0.458192
H  3.650067 1.34043 0.94978
H  1.406768 -2.160401 -0.327227
H  5.507498 -0.1303 1.712747
H  3.274297 -3.636951 0.445694
H  5.337446 -2.625484 1.469018
