program: Gaussian 09
title: 000237462
version: EM64L-G09RevD.01
frameworkgroup: C1[X(C16H22O2)]
method: RPBEPBE
basis: SDD
operation: Freq
keyword: #pfreq=noraman
keyword: PBEPBE/SDD
title: #p freq=noraman PBEPBE/SDD
converged: YES YES NO NO
title: Mulliken charges:
elementType: O O C C C C C C C C C C C C C C C C H H H H H H H H H H H H H H H H H H H H H H
charge: -0.254441 -0.236965 0.366997 -0.420221 -0.421434 -0.384662 -0.445436 0.012091 -0.739498 -0.724269 -0.281381 -0.312813 0.489774 -0.384090 -0.400031 -0.238922 -0.237111 -0.242639 0.235079 0.190389 0.185312 0.236715 0.250954 0.193280 0.196913 0.212516 0.183252 0.215327 0.221328 0.224724 0.222701 0.229276 0.219337 0.237841 0.264656 0.226905 0.230849 0.224202 0.225429 0.228066
chargesum: 0.00000
title: Mulliken charges with hydrogens summed into heavy atoms:
elementType: O O C C C C C C C C C C C C C C C C
charge: -0.254441 -0.236965 0.366997 0.005247 0.000592 0.059572 -0.036006 0.195343 -0.078119 -0.052955 -0.043540 -0.048157 0.489774 -0.157185 -0.169182 -0.014719 -0.011682 -0.014573
polarizability: 2.74570255e+02 -4.91252528e+00 1.62187685e+02 -1.94856277e+01 1.06410302e+01 1.23171706e+02
1716.lowfreq: -12.3624 -7.0132 0.0005 0.0005 0.0007 3.3568 18.2490 24.1622 54.7116
frequency: 16.6162 23.3600 54.6809 70.7092 80.3769 86.6748 118.1162 159.0467 171.8853 203.3576 222.6341 227.0485 251.0071 276.3859 290.3847 303.3707 320.1939 358.7036 397.3224 403.5891 418.2483 471.4061 489.8209 498.1477 517.4170 563.7854 607.1013 616.5237 677.0200 697.3737 726.6313 750.3902 759.3546 784.1023 811.5251 823.5057 848.5457 896.0747 899.9864 920.4203 921.6661 927.5897 931.7157 948.7818 976.0587 988.8033 990.7489 995.6711 1003.6725 1005.4152 1026.2177 1028.1477 1054.0950 1064.0392 1074.7231 1080.6561 1109.2910 1165.9178 1171.9117 1175.8557 1189.4093 1191.8148 1218.2619 1222.1278 1260.8685 1278.2340 1280.2302 1300.5912 1305.8233 1316.0675 1334.6064 1338.0920 1343.9181 1349.2580 1355.1536 1364.9602 1385.8556 1390.4039 1394.0296 1440.6088 1448.3648 1455.4157 1464.1087 1472.6425 1481.0406 1486.4437 1486.7111 1488.3073 1492.9282 1585.1156 1612.6310 1677.0691 2833.9611 2915.5390 2925.7499 2960.5425 2978.4095 2981.0529 2984.8247 3011.3101 3044.2844 3070.6113 3072.0036 3074.5726 3078.3803 3081.2695 3081.4559 3117.3730 3120.5091 3124.3556 3136.8837 3139.3016 3147.9751 3163.8962
redmass: 3.8157 4.0097 3.9109 2.6843 3.2706 2.2122 2.4688 3.3050 4.8523 2.5112 2.6214 1.1780 3.1517 1.8908 2.0909 2.7184 2.0978 2.9849 2.3733 2.7732 3.5642 2.9605 3.2705 3.3972 4.4500 6.1408 4.4427 6.4196 3.4997 1.7382 2.4623 1.2971 1.8599 1.3014 4.3946 2.4212 1.2816 2.6697 2.9871 1.6008 1.9352 2.5446 2.1174 5.9637 1.3874 5.6119 1.3107 2.2042 1.5677 1.2903 2.0419 2.0973 2.9512 2.0197 2.2183 1.7023 2.0600 2.2415 1.0642 1.7526 1.4427 1.3345 1.5537 1.4256 1.3885 1.2875 1.4197 1.4423 1.3819 1.1869 1.3033 1.3167 1.4764 1.4188 1.5442 1.3775 6.5565 1.2188 1.2029 2.2947 1.0792 1.0868 1.0646 1.0809 1.0467 2.0301 1.1182 1.0628 1.0480 5.8365 5.9840 6.3611 1.0797 1.0690 1.0688 1.0611 1.0378 1.0529 1.0465 1.0979 1.0961 1.0974 1.0980 1.0989 1.0970 1.0995 1.0940 1.0881 1.0895 1.0866 1.0906 1.0893 1.0958 1.1015
irintensity: 0.2059 0.2810 0.5112 0.4921 0.1717 0.2777 0.9692 0.2842 1.9773 0.6990 1.8796 0.2918 1.3931 0.4175 0.2727 1.7616 0.4580 1.7999 1.8086 0.1153 3.3167 4.0861 9.4576 4.4221 7.2332 6.5371 6.6234 0.0523 3.3478 43.3915 11.0270 5.1336 45.7484 16.9631 23.9639 14.8831 1.0336 17.9287 46.3956 5.4286 0.1366 25.2533 38.4603 18.2106 0.4513 0.4891 8.0579 82.6391 5.2981 61.0392 12.4642 1.1479 11.2097 86.6716 10.2469 17.3174 60.9390 4.3986 0.6294 21.9902 6.2551 3.8156 9.3783 9.1795 13.8161 3.1689 7.8107 10.3349 16.6623 4.8941 6.9108 6.4542 26.7723 23.7292 55.3917 0.3385 12.9672 17.2295 17.5928 12.7793 6.3384 6.4823 1.1475 30.5249 4.1975 16.8723 17.0328 9.1261 4.2771 2.9993 4.8543 10.7357 75.7071 22.6161 108.4904 55.6606 35.5228 2.2642 44.3239 27.9824 0.7778 17.8896 47.9449 66.5193 47.0237 28.8615 44.5353 2.6431 6.2331 0.7310 24.4931 1.4205 46.4303 27.8757
temp: 298.150 k
press: 1.00000 atm
elementType: 8 8 6 6 6 6 6 6 6 6 6 6 6 6 6 6 6 6 1 1 1 1 1 1 1 1 1 1 1 1 1 1 1 1 1 1 1 1 1 1
symmnumber: 1
zpe: 896656.0 jmol-1
zpe.correction: 0.341518 hartree
zpe.thermalcorrener: 0.359614 hartree
zpe.thermalcorrenthalpy: 0.360558 hartree
zpe.thermalcorrgfe: 0.293792 hartree
zpe.sumelectzpe: -771.940309 hartree
zpe.sumelectthermal: -771.922213 hartree
zpe.sumelectthermalent: -771.921269 hartree
zpe.sumelectthermalfe: -771.988035 hartree
dipole: 2.0166 0.5000 -1.1180
dipole: 2.3593
quadrupole: -91.7520 -105.8562 -110.4301
quadrupole: 1.5652 -4.0686 3.0506
quadrupole: 10.9274 -3.1768 -7.7507 1.5652 -4.0686 3.0506
hfenergy: -772.2818275 hartree
pointgroup: C01 [X(C16H22O2)]
dipole: -0.7804033 -0.441802 -0.2396015 debye
polarizability: 273.6750264|11.3990224|138.0817139|20.3960792|-21.0639748|148.1729059 unknown
InChI: InChI=1S/C16H22O2/c1-3-16(4-2)12-17-15(18-13-16)11-10-14-8-6-5-7-9-14/h5-11,15H,3-4,12-13H2,1-2H3
charge 0 multiplicity 1
40 atoms
O  -1.051621 -0.969714 0.144477
O  -1.407539 0.940215 -1.300484
C  -3.392176 -0.109648 -0.165336
C  -2.478088 -1.349075 0.060368
C  -2.841616 0.608442 -1.431374
C  -3.310278 0.818331 1.083474
C  -4.841997 -0.582697 -0.483935
C  -0.634733 -0.291463 -1.077613
C  -4.183849 2.09041 1.032414
C  -5.578041 -1.307076 0.666365
C  0.817207 0.083242 -0.999623
C  1.671107 -0.398739 -0.056515
C  3.109669 -0.092836 0.074887
C  3.802499 0.806637 -0.78639
C  3.848256 -0.726686 1.113927
C  5.178217 1.056215 -0.613667
C  5.226423 -0.477835 1.288539
C  5.899321 0.415365 0.423993
H  -2.689289 -1.847965 1.019899
H  -2.615646 -2.079601 -0.770233
H  -2.986945 -0.044554 -2.323529
H  -3.345363 1.571414 -1.612433
H  -2.251916 1.106342 1.219492
H  -3.587277 0.224626 1.977847
H  -4.80691 -1.256272 -1.366431
H  -5.44129 0.295846 -0.796904
H  -0.849669 -0.975916 -1.941065
H  -5.260176 1.855118 0.936912
H  -4.054003 2.677237 1.959969
H  -3.902123 2.749032 0.190836
H  -5.042785 -2.218299 0.989992
H  -5.698743 -0.654429 1.549358
H  -6.588039 -1.616182 0.340643
H  1.136645 0.779684 -1.783956
H  1.252046 -1.08551 0.69074
H  3.262338 1.315829 -1.592345
H  3.329569 -1.420154 1.787618
H  5.693229 1.752225 -1.285698
H  5.773601 -0.977586 2.095814
H  6.969083 0.612431 0.555573
