program: Gaussian 09
title: 000237452
version: EM64L-G09RevD.01
frameworkgroup: C1[X(C9H18O2)]
method: RPBEPBE
basis: SDD
operation: Freq
keyword: #pfreq=noraman
keyword: PBEPBE/SDD
title: #p freq=noraman PBEPBE/SDD
converged: YES YES NO NO
title: Mulliken charges:
elementType: O O C C C C C C C C C H H H H H H H H H H H H H H H H H H
charge: -0.301118 -0.272679 0.335522 -0.430366 -0.016296 -0.030556 -0.357976 -0.717520 -0.686814 -0.714427 -0.690726 0.211868 0.214880 0.188570 0.220797 0.226233 0.202271 0.228510 0.219632 0.221513 0.216369 0.222504 0.194601 0.222276 0.211126 0.211213 0.204028 0.229758 0.236808
chargesum: 0.00000
title: Mulliken charges with hydrogens summed into heavy atoms:
elementType: O O C C C C C C C C C
charge: -0.301118 -0.272679 0.335522 -0.003618 0.172274 0.190240 0.070527 -0.047865 -0.053339 -0.069812 -0.020132
polarizability: 1.22550451e+02 -3.20454593e+00 9.34119236e+01 1.95095645e+00 1.43840490e-01 9.19725340e+01
1716.lowfreq: -20.0804 -13.3394 0.0003 0.0007 0.0009 6.9751 31.6448 49.7150 102.3267
frequency: 31.2384 48.2990 102.2698 160.0148 176.9533 217.5575 225.0659 237.6801 252.4368 263.3918 275.0825 312.5900 361.9293 367.8875 388.4331 412.0890 451.0427 517.3981 656.2800 695.0282 722.3094 762.2726 783.6884 818.1471 870.6603 890.0968 910.7529 915.9538 939.6101 960.1826 964.3944 978.8390 1038.9724 1043.5755 1063.6950 1097.4743 1121.2719 1130.0503 1170.9288 1192.0904 1200.6174 1234.3045 1268.6466 1276.5881 1312.0165 1323.4552 1333.9348 1343.3038 1364.8561 1378.4179 1384.4338 1385.2486 1397.9814 1443.1507 1458.2860 1460.4680 1461.8658 1465.3375 1473.0201 1473.8155 1482.9326 1484.4919 1492.2298 2951.1688 2974.2167 2978.1186 2980.3147 2981.8133 2993.3424 2999.7067 3019.8150 3049.8042 3062.4954 3072.6121 3078.6175 3080.6118 3085.9459 3091.2056 3098.1277 3099.0827 3107.0902
redmass: 3.4890 2.8159 2.3629 2.7499 2.2622 1.2676 1.1323 1.1473 1.2385 2.5163 2.2785 2.5175 2.1063 2.0669 1.9795 2.7706 2.9325 3.1812 3.9605 3.4616 5.9285 2.9196 3.1938 3.0045 1.8156 2.7358 1.7751 1.3074 1.6189 1.9350 2.3624 1.7939 1.6326 1.9532 1.7069 1.6743 1.6795 1.8751 2.4295 2.1122 1.3592 1.9897 1.5069 1.6418 1.4289 1.3090 1.4572 1.3630 1.3866 1.2100 1.2408 1.2558 1.2110 1.0811 1.0570 1.0502 1.0594 1.0467 1.0544 1.0499 1.0748 1.0542 1.0544 1.0816 1.0364 1.0654 1.0371 1.0373 1.0601 1.0367 1.0863 1.1012 1.0992 1.0994 1.0983 1.0987 1.0986 1.0991 1.0993 1.1002 1.0997
irintensity: 2.1529 0.4948 0.3945 3.4903 0.5131 0.0755 0.7137 0.7955 0.1574 2.4282 2.5268 2.8140 0.3751 0.9165 1.6299 0.9640 6.5090 10.5504 6.1235 2.8769 5.0285 20.0193 7.6640 18.2929 2.9417 16.0197 8.4605 0.4496 13.8268 36.9684 50.5867 8.5730 15.1524 71.7373 9.9231 36.3863 9.5928 3.9128 60.1020 12.7652 15.9712 30.5982 10.7445 12.0641 29.8587 0.5864 1.2510 5.1577 3.9861 23.2617 42.3677 6.9634 16.9181 3.5228 20.4597 2.5627 0.7787 4.5355 6.1358 10.1484 16.1786 15.0105 7.8237 26.7241 42.0005 47.8674 39.5800 20.1112 28.0624 9.5759 52.6083 19.3281 34.5833 52.5128 35.1498 43.5320 70.4690 32.5477 17.1551 29.9647 20.8341
temp: 298.150 k
press: 1.00000 atm
elementType: 8 8 6 6 6 6 6 6 6 6 6 1 1 1 1 1 1 1 1 1 1 1 1 1 1 1 1 1 1
symmnumber: 1
zpe: 670693.1 jmol-1
zpe.correction: 0.255454 hartree
zpe.thermalcorrener: 0.268482 hartree
zpe.thermalcorrenthalpy: 0.269427 hartree
zpe.thermalcorrgfe: 0.216456 hartree
zpe.sumelectzpe: -503.269707 hartree
zpe.sumelectthermal: -503.256678 hartree
zpe.sumelectthermalent: -503.255733 hartree
zpe.sumelectthermalfe: -503.308704 hartree
dipole: 1.0231 0.0510 0.5517
dipole: 1.1635
quadrupole: -62.0637 -69.9960 -70.9390
quadrupole: -1.2872 4.0187 3.1321
quadrupole: 5.6025 -2.3298 -3.2728 -1.2872 4.0187 3.1321
hfenergy: -503.5251601 hartree
pointgroup: C01 [X(C9H18O2)]
dipole: 0.4054677 0.0103788 -0.2121871 debye
polarizability: 122.5023442|3.7570138|93.4448533|-1.1338884|0.3420042|91.9877108 unknown
InChI: InChI=1S/C9H18O2/c1-7(2)5-9(4)10-6-8(3)11-9/h7-8H,5-6H2,1-4H3
charge 0 multiplicity 1
29 atoms
O  1.305798 -0.858777 0.710085
O  0.561011 0.621059 -0.97988
C  0.085233 -0.442019 -0.061013
C  -0.894685 0.175117 0.955854
C  -2.333502 0.583868 0.515275
C  2.503061 -0.191742 0.123336
C  1.984374 0.329529 -1.238941
C  -0.404373 -1.662882 -0.852421
C  -2.368652 1.462287 -0.758503
C  -3.321698 -0.606633 0.408142
C  3.01244 0.909305 1.062985
H  -0.971184 -0.546733 1.792414
H  -0.376602 1.068096 1.354224
H  -2.703977 1.214039 1.35277
H  3.269147 -0.978731 -0.0067
H  2.451564 1.275031 -1.556585
H  2.094202 -0.432901 -2.035979
H  -0.764246 -2.445471 -0.16316
H  -1.222481 -1.383198 -1.53644
H  0.424167 -2.084736 -1.44719
H  -2.026801 0.90305 -1.647551
H  -1.706109 2.340068 -0.657796
H  -3.398625 1.81853 -0.949978
H  -3.09955 -1.257806 -0.455026
H  -4.355756 -0.233749 0.282237
H  -3.297007 -1.232126 1.320719
H  3.983873 1.307123 0.711902
H  2.287793 1.74146 1.11382
H  3.150089 0.504741 2.080303
