program: Gaussian 09
title: 000237551
version: EM64L-G09RevD.01
frameworkgroup: C1[X(C26H26Cl2N2O2)]
method: RPBEPBE
basis: SDD
operation: Freq
keyword: #p
keyword: freq=noraman
keyword: PBEPBE/SDD
title: #p freq=noraman PBEPBE/SDD
converged: YES YES NO NO
title: Mulliken charges:
elementType: Cl Cl O O N N C C C C C C C C C C C C C C C C C C C C C C C C C C H H H H H H H H H H H H H H H H H H H H H H H H H H
charge: -0.041750 -0.052338 -0.285668 -0.263666 -0.022376 -0.034051 -0.378382 -0.395959 -0.384648 -0.417535 -0.312420 -0.297922 0.401691 0.344821 0.508194 0.509088 -0.551559 -0.525453 -0.147914 -0.144055 -0.370834 -0.329425 -0.320692 -0.307183 -0.209922 -0.190342 0.146394 0.143925 -0.307871 -0.302148 -0.787305 -0.785116 0.203505 0.225109 0.200417 0.208550 0.190479 0.227138 0.209398 0.225872 0.224311 0.199942 0.219396 0.219003 0.282015 0.274949 0.239594 0.264854 0.268459 0.263327 0.270278 0.257734 0.226965 0.247287 0.252892 0.229861 0.228947 0.252138
chargesum: 0.00000
title: Mulliken charges with hydrogens summed into heavy atoms:
elementType: Cl Cl O O N N C C C C C C C C C C C C C C C C C C C C C C C C C C
charge: -0.041750 -0.052338 -0.285668 -0.263666 -0.022376 -0.034051 0.050231 0.013007 0.032969 0.017735 0.111833 0.140477 0.401691 0.344821 0.508194 0.509088 -0.269543 -0.250504 -0.147914 -0.144055 -0.131240 -0.064571 -0.052232 -0.043855 -0.209922 -0.190342 0.146394 0.143925 -0.037593 -0.044414 -0.060161 -0.074170
polarizability: 4.53508216e+02 -9.34511481e+01 3.33622092e+02 1.14091762e+01 1.53543986e+01 2.35889079e+02
1716.lowfreq: -12.3083 -11.2434 -1.7188 0.0009 0.0013 0.0015 5.1221 10.1280 13.5154
frequency: -8.6128 8.2581 13.4150 19.1691 29.2765 36.2118 51.5358 65.3973 80.3887 88.4128 97.6529 104.8129 114.6261 121.3324 139.0218 148.5521 163.1501 172.4437 179.0152 187.9050 192.7288 207.3816 220.8316 227.7082 236.2672 238.7464 272.6592 287.6567 304.0176 316.1880 355.6536 375.0099 382.3217 386.0009 395.4080 419.6462 420.8526 448.5899 464.7877 478.3865 505.3863 513.3304 525.1521 530.3812 533.5158 534.0758 537.5029 590.7311 598.0637 601.3947 618.1195 661.9288 663.7525 686.0288 704.1814 720.3966 769.5472 772.1709 779.0630 792.0774 801.6356 802.5698 812.8008 823.8583 829.5637 833.5675 865.8005 873.7641 878.3362 888.9651 889.7305 903.2500 917.9084 919.0011 943.3989 961.5380 965.0609 965.8018 968.6848 983.0064 997.0221 1005.4619 1007.8488 1017.5783 1044.7876 1046.4316 1073.8431 1079.5365 1112.5870 1118.8441 1121.1789 1124.3536 1149.6302 1156.1638 1163.9387 1184.7953 1193.1876 1195.0830 1225.0081 1249.8055 1252.1151 1263.1837 1270.0394 1271.2196 1279.0473 1289.3622 1293.7177 1295.9904 1308.1225 1319.6114 1332.6169 1337.9774 1351.6760 1355.4385 1364.1819 1372.9178 1374.6336 1384.8493 1389.3282 1392.5562 1394.1072 1398.2992 1450.8135 1451.6738 1455.1630 1461.1737 1463.8938 1464.7062 1467.1676 1467.4322 1468.8499 1469.6381 1477.5484 1485.3444 1488.8272 1494.3091 1532.9977 1537.0254 1586.4176 1588.5457 1628.5041 1633.7938 2955.2714 2966.1051 2972.9494 2981.0821 2981.2941 2982.8811 2993.9552 3012.5508 3016.0843 3018.2969 3040.4578 3049.2469 3058.2868 3059.2691 3062.6565 3082.2776 3118.1120 3119.9477 3146.6325 3158.0372 3165.6036 3168.3184 3168.3702 3171.4056 3171.6150 3177.0792
redmass: 5.1130 7.7729 7.7599 6.8876 6.8637 4.0258 5.7094 3.7935 1.7083 1.6995 1.0978 4.0542 2.7956 3.8467 5.1041 3.9351 4.6618 4.1552 3.4931 4.0480 4.3579 4.1271 5.6083 3.5966 3.5209 2.9343 3.5662 2.6703 3.1409 6.0153 4.8186 5.8525 5.8365 7.5028 5.3674 3.5693 3.4697 3.0532 4.1982 4.4603 3.9703 3.6285 4.5061 6.8403 3.1431 4.1467 3.2491 5.3603 5.4052 4.9288 5.8347 3.6736 3.4308 5.8875 4.7199 1.4340 2.8773 2.7725 2.3009 1.5024 6.1624 6.8310 2.5549 3.8816 1.8095 1.8068 2.4221 1.3800 1.3891 1.5488 1.4878 3.1614 4.5736 2.0229 2.9012 3.3043 1.3495 1.3409 2.5119 2.6051 3.2744 1.8524 1.7987 1.4362 1.5544 1.5549 2.3440 2.1621 2.1361 2.1586 1.8549 1.8932 1.5931 1.5541 1.3327 1.4724 1.7570 1.4859 1.3184 1.6073 1.6987 1.5216 5.7370 2.8190 1.3246 1.5729 2.6846 1.5389 1.2019 1.2696 4.6435 4.1802 1.5112 1.3636 1.4299 2.5008 3.1727 1.9183 1.2598 1.2711 5.1016 4.1249 1.1588 1.6148 1.4931 2.0458 2.0208 1.0855 1.0496 1.0632 1.2036 1.1320 1.1267 1.2885 2.6626 2.1992 6.5512 6.3595 8.1790 8.2477 7.3788 7.2481 1.0557 1.0598 1.0626 1.0390 1.0383 1.0616 1.0647 1.0868 1.0725 1.0983 1.0972 1.1012 1.0973 1.0967 1.1046 1.1074 1.0980 1.0981 1.0874 1.0870 1.0934 1.0933 1.0922 1.0916 1.0961 1.0966
irintensity: 0.0828 0.1328 0.1770 0.1606 0.0120 1.2267 0.5156 0.6118 0.6473 0.8782 0.3766 1.2661 2.5951 0.4955 1.1040 0.2107 1.0475 0.5836 0.0292 0.1942 2.0595 3.5348 4.3229 4.2120 0.8244 3.6974 6.7073 1.2718 2.8097 1.3754 2.7716 0.8900 0.1457 4.6694 3.9199 6.3117 4.2604 2.9171 1.8093 5.1005 4.3712 10.8023 1.6355 0.0398 0.6566 0.7742 2.0685 4.8903 0.0653 4.4621 18.6776 8.9825 5.3955 15.4998 24.8284 7.7368 4.3186 1.9942 5.9404 5.3416 19.7071 27.8911 5.1854 30.4669 39.7112 23.3225 14.7432 7.8639 5.3900 38.1161 55.4623 26.4648 32.7469 3.8917 12.7565 15.3492 0.4426 2.4611 2.8710 30.4365 156.2330 2.1664 5.4891 2.0767 5.1395 10.5077 3.4611 5.0555 23.2397 3.8838 21.5329 47.5191 52.2046 43.5644 0.3982 52.6486 182.3900 11.1648 2.0089 31.8440 115.6744 7.5618 153.4084 99.9775 7.6756 1.2616 3.6337 8.6122 1.5793 0.3898 3.7605 2.1881 0.8779 9.8053 3.0305 47.6167 18.3864 0.0417 22.3486 19.5662 39.4030 46.5596 14.0313 1.8683 3.0453 33.0736 35.7652 5.6808 11.6273 14.3069 10.3796 20.5349 23.1487 76.5617 114.8530 72.1187 38.8835 57.1044 105.0757 100.6729 61.5190 80.3525 40.0799 16.8594 51.2402 12.1243 33.4231 33.3922 15.4163 30.9954 33.3703 17.8307 32.3287 98.4376 18.2743 18.8168 49.6833 51.1007 8.8850 7.4639 7.5388 3.4488 0.8944 2.0971 0.6292 0.4433 10.1541 11.6118
temp: 298.150 k
press: 1.00000 atm
elementType: 17 17 8 8 7 7 6 6 6 6 6 6 6 6 6 6 6 6 6 6 6 6 6 6 6 6 6 6 6 6 6 6 1 1 1 1 1 1 1 1 1 1 1 1 1 1 1 1 1 1 1 1 1 1 1 1 1 1
symmnumber: 1
zpe: 1198336.1 jmol-1
zpe.correction: 0.456422 hartree
zpe.thermalcorrener: 0.486316 hartree
zpe.thermalcorrenthalpy: 0.487260 hartree
zpe.thermalcorrgfe: 0.391883 hartree
zpe.sumelectzpe: -2184.141751 hartree
zpe.sumelectthermal: -2184.111857 hartree
zpe.sumelectthermalent: -2184.110913 hartree
zpe.sumelectthermalfe: -2184.206290 hartree
dipole: 2.9112 -1.3508 -0.7389
dipole: 3.2932
quadrupole: -178.5840 -198.1133 -206.5574
quadrupole: -28.1585 -5.4512 -0.5845
quadrupole: 15.8342 -3.6950 -12.1392 -28.1585 -5.4512 -0.5845
hfenergy: -2184.5981728 hartree
pointgroup: C01 [X(C26H26Cl2N2O2)]
dipole: 1.270548 -0.1390741 0.2123933 debye
polarizability: 502.2765151|23.6877102|246.6399755|3.6575565|26.6533694|274.1028967 unknown
InChI: InChI=1S/C26H26Cl2N2O2/c1-17-13-23(27)21-15-19(7-9-25(21)29-17)31-11-5-3-4-6-12-32-20-8-10-26-22(16-20)24(28)14-18(2)30-26/h7-10,13-16H,3-6,11-12H2,1-2H3
charge 0 multiplicity 1
58 atoms
Cl 0.282558 -0.70037 -4.207938
Cl -4.078369 3.896728 3.602191
O  4.968898 -0.739262 -1.723333
O  0.602801 2.220448 1.762497
N  0.082355 -3.145765 -0.244732
N  -4.613942 0.904025 0.067551
C  4.687363 1.853948 -0.149327
C  4.327726 1.506133 1.315936
C  6.010133 1.225468 -0.649024
C  3.014821 2.160632 1.814013
C  5.989309 -0.311209 -0.733664
C  1.774886 1.608329 1.102794
C  3.771445 -1.33637 -1.307943
C  -0.673473 1.869394 1.307175
C  1.421554 -1.766038 -1.854639
C  -3.084555 2.174031 1.597333
C  2.675612 -1.169849 -2.167168
C  -1.747862 2.468509 1.980461
C  1.272427 -2.549293 -0.636482
C  -3.340665 1.249413 0.501766
C  3.645322 -2.13069 -0.119307
C  -0.909794 0.958119 0.225071
C  2.419537 -2.715589 0.200949
C  -2.218526 0.665665 -0.160518
C  0.233813 -1.653172 -2.651526
C  -4.257958 2.722665 2.213666
C  -1.003182 -2.995385 -1.030799
C  -5.676639 1.454716 0.687988
C  -0.958998 -2.246426 -2.264065
C  -5.532056 2.383724 1.782879
C  -2.303713 -3.622908 -0.580767
C  -7.060168 1.074157 0.204317
H  4.761931 2.95602 -0.242234
H  3.873807 1.540232 -0.830817
H  4.243568 0.407141 1.439344
H  5.157195 1.832565 1.974973
H  6.846694 1.514542 0.021637
H  6.249588 1.623005 -1.653427
H  3.056274 3.257764 1.673025
H  2.895605 1.979193 2.898802
H  6.951095 -0.694579 -1.116158
H  5.797628 -0.76272 0.255641
H  1.76815 1.871286 0.026468
H  1.724841 0.503926 1.202587
H  2.797053 -0.574995 -3.076532
H  -1.545341 3.160639 2.80201
H  4.510361 -2.30725 0.52753
H  -0.076847 0.487192 -0.303967
H  2.298952 -3.328736 1.098942
H  -2.421539 -0.02075 -0.987399
H  -1.859786 -2.156553 -2.87738
H  -6.421161 2.806807 2.258113
H  -2.739101 -4.26208 -1.37094
H  -3.053143 -2.845224 -0.337491
H  -2.128479 -4.232011 0.318889
H  -7.619698 1.961679 -0.146712
H  -7.655415 0.611449 1.013936
H  -6.975196 0.358382 -0.627497
